{"text_format":"1","workbook":"xlsx","n_sheets":8,"sheets":["SOFTWARE T-CON","Analisi","Relazione","Verifica Armatura","Note","Caratteristiche Materiali","Prescrizioni","Foglio1"],"not_rendered":{"charts":3,"images":6,"macros":1,"external_links":0,"defined_names":3,"comments":3,"pivot_tables":0},"unopened":[],"bounds":{"document_bytes":16777216,"sheet_cells":100000,"rows_first":2000,"rows_last":500,"rows_between":2000,"halvings":0,"cell_chars":16384,"cell_head_chars":4096},"cells_cut":0,"cells_raw":0,"read":"whole","date_system":"1900"}

{"sheet":"SOFTWARE T-CON","index":0,"n_rows":37,"n_cols":30,"rows_kept":37,"cut":false,"hidden":false,"merged":[[23,0,23,5],[11,0,11,2],[10,0,10,1],[9,0,9,1],[8,0,8,1],[8,2,8,5],[18,7,18,9],[9,2,9,5],[10,2,10,5],[6,0,6,5],[13,0,13,5]]}
[]
[]
[]
[]
[]
[]
["1) Dati Generali:",null,null,null,null,null,null,"4) Carichi agenti sulla struttura:",null,null,null,null,null,null,null,null,null,null,null,null,null,null,null,null,null,null,null,null,"versione","2.8.2"]
[]
["Cliente/Cantiere:",null,null,null,null,null,null,"Peso permanente strutturale:",null,null,"G1,k ="]
["Identificativo solaio:",null,"C1",null,null,null,null,null,null,null,"=",2.2999999999999998,"kN/m2"]
["Tecnico:",null,"Ufficio Tecnico",null,null,null,null,"Peso permanente non strutturale:",null,null,"G2,k =",2.5,"kN/m2"]
["Normativa di riferimento:",null,null,null,null,null,null,"Carico concentrato (se presente):",null,null,"Pk =",0,"kN"]
[null,null,null,null,null,null,null,"Posizione rispetto appoggio sinistro:",null,null,"a =",3650,"mm"]
["2) Dimensioni del sistema:",null,null,null,null,null,null,"Tipologia di carico variabile:"]
[]
["Luce netta:",null,null,"Lnetta =",4650,"mm",null,"Carico variabile (vedere \"NOTE\"):",null,null,"Qk =",2,"kN/m2"]
["Larghezza appoggi:",null,null,"Lappoggi =","-","mm",null,"Classe di durata del carico:",null,null,null,"            (per info vedere foglio \"NOTE\")",null,null,null,null,null,null,null,null,null,null,null,null,"  "]
["Larghezza vano:",null,null,"Lvano =","-","mm"]
["Interassi travi in legno:",null,null,"i =",650,"mm",null,"5) Inclinazione della struttura:",null,null,"pendenza =",null,"%"]
["Limite freccia istantanea:",null,null,"L/uiniziale =",400,"-"]
["Limite freccia finale totale:",null,null,"L/ufinale =",300,"-",null,"6) Materiali:"]
["Classe di servizio della struttura:",null,null,null,"  (per info vedere foglio \"NOTE\")",null,null,"Classe di resistenza legname:"]
[null,null,null,null,null,null,null,"Classe di resistenza calcestruzzo:"]
["3) Dimensioni sezione trasversale:",null,null,null,null,null,null,"Tipologia di strato interposto:"]
["Larghezza efficace della soletta:",null,null,"b1 =",{"$f":"MIN(E16/5+E28,E19)","v":650},"mm",null,"Rete elettrosaldata:",null,"f"]
["Spessore della soletta:",null,null,"h1 =",60,"mm",null,"Armatura aggiuntiva:",null,"nb",null,"f"]
["Spessore strato interposto (assito,…):",null,null,"tS =",20,"mm"]
["Base della sezione lignea:",null,null,"b2 =",160,"mm",null,"7) Tipologia di connettore:"]
["Altezza della sezione lignea:",null,null,"h2 =",240,"mm",null,"Inclinazione del connettore:",null,null,"a",null,"°"]
["Spessore isolante (eventuale):",null,null,"hiso =",0,"mm",null,"Numero connettori in una sezione:",null,null,"nc =",1,"-"]
[{"$f":"IF(E30=0,\"ATTENZIONE!! Se h_iso=0, h_1 >= 6cm!!\",\"\")","v":"ATTENZIONE!! Se h_iso=0, h_1 >= 6cm!!"},null,null,null,null,null,null,"Passo minimo dei connettori:",null,null,"smin =",130,"mm"]
[null,null,null,null,null,null,null,"Passo massimo dei connettori:",null,null,"smax =",330,"mm"]
["Il presente foglio non può essere modificato e/o distributo in alcun modo senza il consenso scritto di RoofRox Srl."]
[]
[]
[null,null,null,null,null,null,null,{"$f":"IF(E30=0,E26>=60,E26>=50)","v":true},null,"PER G1",{"$f":"Prescrizioni!L88","v":1}]
[null,null,null,null,null,null,null,null,null,"per a",{"$f":"IF(L12=0,1,2)","v":1}]

{"sheet":"Analisi","index":1,"n_rows":285,"n_cols":34,"rows_kept":285,"cut":false,"hidden":false,"merged":[[255,0,255,12],[94,0,94,12],[85,0,85,12],[117,10,117,12],[107,0,107,12],[127,3,127,5],[127,10,127,12],[120,0,120,6],[120,7,120,12],[135,0,135,12],[91,0,91,12],[197,0,197,12],[99,9,99,12],[112,9,112,12],[129,4,129,7],[129,11,129,12],[219,0,219,12],[80,0,80,12],[110,10,110,12],[111,10,111,12],[115,10,115,12],[93,10,93,12],[97,10,97,12],[98,10,98,12],[102,10,102,12],[104,10,104,12],[115,0,115,3],[102,0,102,3],[129,0,129,2],[128,0,128,12],[109,0,109,2],[195,0,195,2],[66,11,66,12],[65,0,65,12],[6,0,7,12],[48,10,48,12],[10,0,10,12],[18,0,18,6],[26,0,26,6],[33,7,33,12],[33,0,33,6],[39,3,39,5],[21,3,21,5],[42,3,42,5],[41,0,41,12],[8,9,8,12],[21,0,22,0],[164,13,193,13],[96,8,96,9],[109,8,109,9],[144,10,144,12],[145,0,145,12],[110,0,110,2],[114,0,114,2],[113,0,113,2],[96,0,96,2],[97,0,97,2],[100,0,100,2],[101,0,101,2],[149,0,149,12],[155,10,155,12],[195,4,195,7],[195,11,195,12],[156,0,156,12],[159,10,159,12],[194,0,194,12],[160,0,160,12],[80,14,127,14],[15,14,64,14],[15,13,64,13],[80,13,127,13],[148,10,148,12],[130,14,159,14],[72,0,72,12],[73,7,73,12],[73,0,73,6],[39,0,39,2],[50,3,50,5],[56,3,56,5],[62,3,62,5],[49,0,49,12],[66,0,66,2],[66,4,66,7]]}
[]
[]
[]
[]
[]
[]
["CALCOLO E VERIFICA DI SOLAI MISTI LEGNO-CLS CON CONNETTORI T-CON"]
[]
["Cantiere:",{"$f":"'SOFTWARE T-CON'!C9","v":0},null,null,null,null,null,"Posizione solaio:",null,{"$f":"'SOFTWARE T-CON'!C10","v":"C1"}]
["Data:",{"$f":"TODAY()","v":"2018-12-21"},null,null,null,null,null,"Normativa di riferimento:",null,null,{"$f":"VLOOKUP(Prescrizioni!B7,Prescrizioni!B3:F6,2)","v":"D.M. 17.01.2018 - Colonna \"A\""}]
["GEOMETRIA DEL SOLAIO"]
["Dati sulla lunghezza delle travi del solaio",null,null,null,null,null,null,"Altri dati geometrici e sulla deformabilità:"]
["Luce netta tra gli appoggi:",null,null,"Lnet",{"$f":"'SOFTWARE T-CON'!E16","v":4650},"mm",null,"Interasse travi:",null,null,"i",{"$f":"'SOFTWARE T-CON'!E19","v":650},"mm"]
["Lunghezza appoggio sx:",null,null,"Lapp,sx",{"$f":"'SOFTWARE T-CON'!E17","v":"-"},"mm",null,"Limite freccia istantanea:",null,null,"L/u0",{"$f":"'SOFTWARE T-CON'!E20","v":400},"-"]
["Lunghezza appoggio dx:",null,null,"Lapp,dx",{"$f":"E14","v":"-"},"mm",null,"Limite freccia finale:",null,null,"L/u¥",{"$f":"'SOFTWARE T-CON'!E21","v":300},"-"]
["Lungh. totale della trave:",null,null,"Ltot",{"$f":"IF(AND(E14=\"-\",E15=\"-\"),\"-\",SUM(E13:E15))","v":"-"},"mm",null,null,null,null,null,null,null,"Il presente foglio non può essere modificato e/o distributo in alcun modo senza il consenso scritto di RoofRox Srl."]
["Luce di calcolo:",null,null,"Lcalcolo",{"$f":"IF(AND(E14=\"-\",E15=\"-\"),1.05*E13,IF(Prescrizioni!B187>1,ROUNDUP(VLOOKUP(Prescrizioni!B187,Prescrizioni!B86:F186,5)*Analisi!E13,0),(E14/2+E13+E15/2)))","v":4882.5},"mm",null,"Dimensione trasversale solaio:",null,null,"Lvano",{"$f":"'SOFTWARE T-CON'!E18","v":"-"},"mm"]
[{"$f":"'SOFTWARE T-CON'!H13","v":"Posizione rispetto appoggio sinistro:"},null,null,"a",{"$f":"'SOFTWARE T-CON'!L13","v":3650},"mm"]
["CARATTERISTICHE GEOMETRICHE DELLA SEZIONE DELLE TRAVI"]
["Soletta","- base:",null,"b1",{"$f":"L13","v":650},"mm"]
[null,"- altezza:",null,"h1",{"$f":"'SOFTWARE T-CON'!E26","v":60},"mm"]
["Strato intermedio","- tipologia:",null,{"$f":"VLOOKUP('Caratteristiche Materiali'!B81,'Caratteristiche Materiali'!B65:D75,2)","v":"Legno di Conifera C24"}]
[null,"- spessore:",null,"tS",{"$f":"'SOFTWARE T-CON'!E27","v":20},"mm",null,null,null,null,null,null,null,null,null,null,null,null,null,null,"min sp soletta",{"$f":"IF(E23=0,40,60)","v":60}]
["Trave ","- base:",null,"b2",{"$f":"'SOFTWARE T-CON'!E28","v":160},"mm"]
[null,"- altezza:",null,"h2",{"$f":"'SOFTWARE T-CON'!E29","v":240},"mm"]
["Isolante ","- altezza:",null,"hisolante",{"$f":"'SOFTWARE T-CON'!E30","v":0},"mm"]
["ANALISI DEI CARICHI"]
[{"$f":"IF('SOFTWARE T-CON'!K36=1,\"Peso proprio trave lignea:\",\"\")","v":"Peso proprio trave lignea:"},null,null,{"$f":"IF('SOFTWARE T-CON'!K36=1,\"pp. Trave\",\"\")","v":"pp. Trave"},{"$f":"IF('SOFTWARE T-CON'!K36=1,(5.5*E24*E25/10^6),0)","v":0.2112},{"$f":"IF('SOFTWARE T-CON'!K36=1,\"kN/m\",\"\")","v":"kN/m"}]
["Permanente strutturale:",null,null,"G1,k",{"$f":"IF('SOFTWARE T-CON'!K36=1,((VLOOKUP('Caratteristiche Materiali'!$B$52,'Caratteristiche Materiali'!$B$42:$K$51,7))*E21/1000+(VLOOKUP('Caratteristiche Materiali'!$B$81,'Caratteristiche Materiali'!B65:F80,3))/100*E23/1000)+(VLOOKUP('Caratteristiche Materiali'!$B$52,'Caratteristiche Materiali'!$B$42:$K$51,7))*(E26/1000)*(E24/1000)/(E20/1000),'SOFTWARE T-CON'!L10)","v":1.61},"kN/m2"]
["Permanente non strutturale:",null,null,"G2,k",{"$f":"'SOFTWARE T-CON'!L11","v":2.5},"kN/m2"]
["Carico concentrato:",null,null,"Pk",{"$f":"'SOFTWARE T-CON'!L12","v":0},"kN"]
["Tipologia edificio:",null,null,{"$f":"VLOOKUP(Prescrizioni!B32,Prescrizioni!B24:G30,2)","v":"Cat. A: Amb. ad uso residenziale"}]
["Carico accidentale:",null,null,"Qk",{"$f":"'SOFTWARE T-CON'!L16","v":2},"kN/m2"]
["COMBINAZIONI DI CARICO",null,null,null,null,null,null,"COEFFICIENTI PARZIALI DI SICUREZZA"]
["Azione dei soli carichi permanenti:",null,null,"qtot,1",{"$f":"(E28*L35+(E29*L35+E30*L36)*E20/1000)*(COS(VLOOKUP(Prescrizioni!B187,Prescrizioni!B86:F186,4)))","v":4.0725099999999994},"kN/m",null,"Coefficiente per carichi G1:",null,null,"gG1",1.3,"-"]
["Azione di tutti i carichi:",null,null,"qtot,2",{"$f":"(E28*L35+(E29*L35+E30*L36)*E20/1000)*(COS(VLOOKUP(Prescrizioni!B187,Prescrizioni!B86:F186,4)))+((E33*L36)*E20/1000)*(COS(VLOOKUP(Prescrizioni!B187,Prescrizioni!B86:F186,4)))","v":6.0225099999999996},"kN/m",null,"Coefficienti per carichi G2/Q:",null,null,"gG2",1.5,"-"]
["Carico concentrato di progetto:",null,null,"Pd",{"$f":"E31*L36*(COS(VLOOKUP(Prescrizioni!B187,Prescrizioni!B86:F186,4)))","v":0},"kN",null,"Coeff \"quasi permanente\" per Q:",null,null,"y2",1,"-"]
["Classe di servizio della struttura:",null,null,null,{"$f":"VLOOKUP(Prescrizioni!D43,Prescrizioni!D40:F42,2)","v":1},null,null,"Coeff. di deformabilità differita:",null,null,"kdef",{"$f":"VLOOKUP(Prescrizioni!$D$43,Prescrizioni!D40:F42,3)","v":0.6},"-"]
[]
["Classe di durata del carico:",null,null,{"$f":"VLOOKUP(Prescrizioni!D60,Prescrizioni!D55:F59,2)","v":"Media"},null,null,null,"Coeff. di resistenza differita:",null,null,"kmod",{"$f":"VLOOKUP(Prescrizioni!$D$60,Prescrizioni!D55:F59,3)","v":0.8},"-"]
[]
["CARATTERISTICHE PRINCIPALI DEL CONNETTORE"]
["Tipologia di connettore:",null,null,{"$f":"VLOOKUP('Caratteristiche Materiali'!B60,'Caratteristiche Materiali'!B58:T59,2)","v":"T-CON 8.0x205"},null,null,null,"Inclinazione connettore:",null,null,"a",{"$f":"VLOOKUP(Prescrizioni!B67,Prescrizioni!B65:C66,2)","v":45},"°"]
["Rigidezza connettore allo SLE:",null,null,"Kser",{"$f":"IF('Caratteristiche Materiali'!B52<=5,IF(Prescrizioni!B67=2,IF($E$23=0,2000,700),90*$L$259),VLOOKUP('Caratteristiche Materiali'!B52,'Caratteristiche Materiali'!B42:K51,8)*(IF(Prescrizioni!B67=2,IF($E$23=0,2000,700),90*$L$259)))","v":9000},"N/mm",null,"Lunghezza totale connettore:",null,null,"Ltot",{"$f":"VLOOKUP('Caratteristiche Materiali'!$B$60,'Caratteristiche Materiali'!$B$58:$G$59,4)","v":208.85},"mm"]
["Rigidezza connettore allo SLU:",null,null,"Ku",{"$f":"2/3*$E$44","v":6000},"N/mm",null,"Lunghezza tratto filettato:",null,null,"Lfiletto",{"$f":"VLOOKUP('Caratteristiche Materiali'!$B$60,'Caratteristiche Materiali'!$B$58:$G$59,5)","v":130},"mm"]
["Numero connettori affiancati:",null,null,"nc",{"$f":"'SOFTWARE T-CON'!L30","v":1},"-",null,"Lunghezza tratto in cls:",null,null,"Lcls",{"$f":"$L$260","v":64.849999999999994},"mm"]
["Passo minimo connessione:",null,null,"pmin",{"$f":"'SOFTWARE T-CON'!L31","v":130},"mm",null,"Lunghezza tratto in legno:",null,null,"Lwood",{"$f":"L258","v":115.7157287525381},"mm"]
["Passo massimo connessione:",null,null,"pmax",{"$f":"'SOFTWARE T-CON'!L32","v":330},"mm",null,"Ricoprimento testa conn. (>10mm):",null,null,"cS",{"$f":"IF(AND(L262>=9.95,L262<=9.99),10,L262)","v":10},"mm"]
[null,null,null,null,null,null,null,null,null,null,{"$f":"IF(L48>=10,\"VERIFICATO!\",\"RICONTROLLARE!\")","v":"VERIFICATO!"}]
["CARATTERISTICHE PRINCIPALI DEI MATERIALI"]
["Classe della trave lignea:",null,null,{"$f":"VLOOKUP('Caratteristiche Materiali'!B33,'Caratteristiche Materiali'!B5:O32,2)","v":"GL24h"}]
["Resistenza caratt. a flessione:",null,null,"fm,k",{"$f":"VLOOKUP('Caratteristiche Materiali'!$B$33,'Caratteristiche Materiali'!B5:O32,3)","v":24},"N/mm2",null,"Resistenza di progetto  a flessione:",null,null,"fm,d",{"$f":"E52*$L$40/$L$55","v":13.241379310344829},"N/mm2"]
["Resistenza caratt. a trazione:",null,null,"ft,0,k",{"$f":"VLOOKUP('Caratteristiche Materiali'!$B$33,'Caratteristiche Materiali'!B5:O32,4)","v":19.2},"N/mm2",null,"Resistenza di progetto a trazione:",null,null,"ft,0,d",{"$f":"E53*$L$40/$L$55","v":10.593103448275862},"N/mm2"]
["Resistenza caratt. a taglio:",null,null,"fV,k",{"$f":"VLOOKUP('Caratteristiche Materiali'!$B$33,'Caratteristiche Materiali'!B5:O32,8)","v":3.5},"N/mm2",null,"Resistenza di progetto a taglio:",null,null,"fV,d",{"$f":"E54*$L$40/$L$55","v":1.931034482758621},"N/mm2"]
["Modulo elastico // alle fibre:",null,null,"E2",{"$f":"VLOOKUP('Caratteristiche Materiali'!$B$33,'Caratteristiche Materiali'!B5:O32,9)","v":11500},"N/mm2",null,"Coeff. parziale di sicurezza:",null,null,"gM,L",{"$f":"IF('Caratteristiche Materiali'!$B$33<=8,VLOOKUP(Prescrizioni!$B$7,Prescrizioni!B3:E6,3),VLOOKUP(Prescrizioni!$B$7,Prescrizioni!B3:E6,4))","v":1.45},"-"]
[]
["Classe del calcestruzzo:",null,null,{"$f":"VLOOKUP('Caratteristiche Materiali'!B52,'Caratteristiche Materiali'!B42:H51,2)","v":"C25/30"}]
["Resistenza caratt. a compressione:",null,null,"fc,k",{"$f":"VLOOKUP('Caratteristiche Materiali'!$B$52,'Caratteristiche Materiali'!$B$42:$G$51,3)","v":25},"N/mm2",null,"Res. di progetto a compressione:",null,null,"fc,d",{"$f":"E58*L61/L60","v":14.166666666666666},"N/mm2"]
["Resistenza caratt. a trazione:",null,null,"ft,k",{"$f":"VLOOKUP('Caratteristiche Materiali'!$B$52,'Caratteristiche Materiali'!$B$42:$G$51,5)","v":1.7954747440105308},"N/mm2",null,"Resistenza di progetto a trazione:",null,null,"ft,d",{"$f":"IF('Caratteristiche Materiali'!B52<=5,E59/L60,E59*L61/L60)","v":1.1969831626736871},"N/mm2"]
["Modulo elastico:",null,null,"E1",{"$f":"VLOOKUP('Caratteristiche Materiali'!$B$52,'Caratteristiche Materiali'!$B$42:$G$51,6)","v":31447.161439943484},"N/mm2",null,"Coeff. Parziale di sicurezza:",null,null,"gM,cls",1.5,"-"]
["Coeff. di viscosità a t=∞:",null,null,"f",2,"-",null,"Coeff. effetti a lungo termine",null,null,"aCC",0.85,"-"]
[]
["Rete elettrosaldata:",null,"Æ",{"$f":"VLOOKUP('Caratteristiche Materiali'!O48,'Caratteristiche Materiali'!O42:R47,2)","v":"6 mm/20x20"},null,null,null,"Area di acciaio per metro lineare",null,null,"A",{"$f":"VLOOKUP('Caratteristiche Materiali'!O48,'Caratteristiche Materiali'!O42:R47,4)","v":141.37166941154069},"mm2/m"]
["Resistenza caratt.(Acciaio. B450C):",null,null,"fy,k",450,"N/mm2",null,"Resistenza di progetto (Acc. B450C):",null,null,"fy,d",{"$f":"E64/L65","v":391.304347826087},"N/mm2"]
["Copriferro armatura:",null,null,"s",30,"mm",null,"Coeff. Parziale di sicurezza:",null,null,"gM,S",1.1499999999999999,"-"]
["NB: Prima dell'esecuzione tutti i calcoli devono essere verificati e approvati dal progettista responsabile delle strutture."]
[{"$f":"CONCATENATE('SOFTWARE T-CON'!$A$11,'SOFTWARE T-CON'!$Y$17,'SOFTWARE T-CON'!$C$11)","v":"Tecnico:  Ufficio Tecnico"},null,null,null,{"$f":"E130","v":"Versione 2.8.2"},null,null,null,null,null,null,"Pagina 1/3"]
[]
[]
[]
[]
[]
["SOLLECITAZIONI MASSIME"]
["TEMPO--> t=0",null,null,null,null,null,null,"TEMPO--> t=¥"]
["Momento massimo in campata:",null,null,"Mmax",{"$f":"IF('SOFTWARE T-CON'!$L$12=0,(MAX($E$35:$E$36))*($E$17/1000)^2/8,-(MAX($E$35:$E$36))/2*($E$17/1000*1/2+'SOFTWARE T-CON'!$L$12/(MAX($E$35:$E$36))*(Analisi!$E$17-Analisi!$E$18)/Analisi!$E$17)^2+((MAX($E$35:$E$36))*(Analisi!$E$17/1000)/2+'SOFTWARE T-CON'!$L$12*(Analisi!$E$17-Analisi!$E$18)/Analisi!$E$17)*((Analisi!$E$17/1000)/2+'SOFTWARE T-CON'!$L$12/(MAX($E$35:$E$36))*(Analisi!$E$17-Analisi!$E$18)/Analisi!$E$17))","v":17.946181128585938},"kNm",null,"Momento massimo in campata:",null,null,"Mmax",{"$f":"E75","v":17.946181128585938},"kNm"]
["Momento massimo nella soletta:",null,null,"Mmax,1",{"$f":"L204/$L$216*($E$75)","v":1.5171941410476326},"kNm",null,"Momento massimo nella soletta:",null,null,"Mmax,1",{"$f":"L228/$L$240*($E$75)","v":0.85926886208269537},"kNm"]
["Momento massimo nella trave:",null,null,"Mmax,2",{"$f":"L203/$L$216*($E$75)","v":8.7406583893467431},"kNm",null,"Momento massimo nella trave:",null,null,"Mmax,2",{"$f":"L227/$L$240*($E$75)","v":9.2818241559400558},"kNm"]
["Azione assiale max nella soletta:",null,null,"Nmax,1",{"$f":"((E204*$L$214*E215)/$L$216)*($E$75*10^3)","v":45.225462342303288},"kN",null,"Azione assiale max nella soletta:",null,null,"Nmax,1",{"$f":"($E$75*10^3)*(E228*L238*E239)/$L$240","v":45.912283003312872},"kN"]
["Azione assiale max nella trave:",null,null,"Nmax,2",{"$f":"($E$75*10^3)*(E203*$L$215*E216)/$L$216","v":45.225462342303302},"kN",null,"Azione assiale max nella trave:",null,null,"Nmax,2",{"$f":"($E$75*10^3)*(E227*E240)/$L$240","v":45.912283003312872},"kN"]
["Taglio massimo all'appoggio:",null,null,"Vmax",{"$f":"IF('SOFTWARE T-CON'!L12=0,(MAX($E$35:$E$36))*($E$17/1000)/2,MAX((MAX($E$35:$E$36))*($E$17/1000)/2+'SOFTWARE T-CON'!L12*(Analisi!E17-Analisi!E18)/Analisi!E17,(MAX($E$35:$E$36))*($E$17/1000)/2+'SOFTWARE T-CON'!L12*(Analisi!E18)/Analisi!E17))","v":14.702452537499999},"kN",null,"Taglio massimo all'appoggio:",null,null,"Vmax",{"$f":"E80","v":14.702452537499999},"kN"]
["QUADRO DI VERIFICA",null,null,null,null,null,null,null,null,null,null,null,null,"Il presente foglio non può essere modificato e/o distributo in alcun modo senza il consenso scritto di RoofRox Srl."]
["Superficie totale solaio:",null,null,"Atot",{"$f":"IF('SOFTWARE T-CON'!E18=\"-\",\"-\",(E17*L17/10^6))","v":"-"},"m2",null,null,null,null,null,null,null,null,null,"spazi pmax",{"$f":"IF(E47=E48,(INT(E17/E48)),INT(0.5*E17/E48))","v":7},null,{"$f":"ISODD(Q82)","v":true}]
["Numero di connettori per trave:",null,null,"nc,trave",{"$f":"(2*Q85+Q84)*E46","v":26},"-",null,"Numero di connettori totale:",null,null,"nc,totale",{"$f":"IF('SOFTWARE T-CON'!E18=\"-\",Analisi!E83,E83*ROUNDUP('SOFTWARE T-CON'!E18/'SOFTWARE T-CON'!E19,0))","v":26},"-",null,null,"spazi pmin",{"$f":"IF(E48=E47,0,INT(((E17-Q82*E48)/2)/E47))","v":9}]
["Distanza minima da bordo trave:",null,null,"a3",{"$f":"(E17-2*Q83*E47-Q82*E48)/2","v":116.25},"mm",null,"Incidenza al metro quadro:",null,null,"incidenza",{"$f":"IF('SOFTWARE T-CON'!E18=\"-\",\"-\",L83/E82)","v":"-"},"conn/m2",null,null,"conn p max",{"$f":"IF(S82=FALSE(),Q82,Q82+1)","v":8}]
["Distanza minima bordo trave finale:",null,null,"a3,finale",{"$f":"IF(E47=E48,E84,IF(E84<=75,E84+E47,E84))","v":116.25},"mm",null,null,null,null,null,null,null,null,null,"conn pmin",{"$f":"(IF(E48=E47,0,IF(S82=FALSE(),Q83-1,Q83)))","v":9}]
["VERIFICHE GEOMETRICHE SUI CONNETTORI"]
["Spaziatura longitudinale",null,null,"a1",{"$f":"E47","v":130},"mm",{"$f":"IF(E87>=L87,\"OK!\",\"NO!\")","v":"OK!"},"Verifica spaziatura longitudinale",null,null,"a1,min",{"$f":"MIN(100,(4+ABS(COS(E267)))*E260)","v":37.656854249492383},"mm"]
["Spaziatura trasversale",null,null,"a2",{"$f":"IF(E46=1,E24/2,E24-2*E90)","v":80},"mm",{"$f":"IF(E88>=L88,\"OK!\",\"NO!\")","v":"OK!"},"Verifica spaziatura longitudinale",null,null,"a2,min",{"$f":"(3+SIN(E267))*E260","v":29.65685424949238},"mm"]
["Spaziatura dal bordo (long.)",null,null,"a3",{"$f":"E85","v":116.25},"mm",{"$f":"IF(E89>=L89,\"OK!\",\"NO!\")","v":"OK!"},"Verifica spaziatura longitudinale",null,null,"a3,min",{"$f":"((7+5*(COS(E267)))*E260)","v":84.284271247461902},"mm"]
["Spaziatura dal bordo (trasv.)",null,null,"a4",40,"mm",{"$f":"IF(E90>=L90,\"OK!\",\"NO!\")","v":"OK!"},"Verifica spaziatura longitudinale",null,null,"a4,min",{"$f":"(3+2*SIN(E267))*E260","v":35.313708498984759},"mm"]
[]
["GRANDEZZE RELATIVE ALLA SEZIONE COMPOSTA"]
["Passo equival. della connessione:",null,null,"peq",{"$f":"0.75*E47+0.25*E48","v":180},"mm",null,"Rapporto tra pmax/pmin:",null,null,"r",{"$f":"(E48/E47)","v":2.5384615384615383},"-"]
[null,null,null,null,null,null,null,null,null,null,{"$f":"IF(L93>4,\"RICONTROLLARE!\",\"VERIFICATO!\")","v":"VERIFICATO!"}]
["VERIFICA DELLE SOLLECITAZIONI ALLO SLU A TEMPO t=0"]
["Soll. normali nel cls: - Compressione",null,null,"s1",{"$f":"($E$78*10^3)/($E$20*$E$21+$E$26*$E$24)","v":1.1596272395462381},"N/mm2"]
["                                          - Flessione sup.",null,null,"sm,sup,1",{"$f":"(E76*10^6)*(E21+E26-L200)/((($E$24*$E$26^3/12)+$E$26*$E$24*($L$200-$E$26/2)^2+($E$20*$E$21^3/12)+$E$20*$E$21*($L$200-$E$21/2)^2))","v":3.8902413873016215},"N/mm2",null,null,"-Flessione inf.",null,"sm,inf.,1",{"$f":"(E76*10^6)*(L200)/((($E$24*$E$26^3/12)+$E$26*$E$24*($L$200-$E$26/2)^2+($E$20*$E$21^3/12)+$E$20*$E$21*($L$200-$E$21/2)^2))","v":3.8902413873016215},"N/mm2"]
["Tens. normale:lembo sup. compresso:",null,null,"s1,C",{"$f":"E96+E97","v":5.0498686268478599},"N/mm2",null,{"$f":"IF(E98<=L58,\"minore di\",\"maggiore di\")","v":"minore di"},"fc,k",null,{"$f":"IF(E98<=L58,\"VERIFICATO!\",\"RICONTROLLARE!\")","v":"VERIFICATO!"}]
["Tens. normale: lembo inferiore teso:",null,null,"s1,T",{"$f":"L97-E96","v":2.7306141477553831},"N/mm2",null,{"$f":"IF(E99<=L59,\"minore di\",\"maggiore di\")","v":"maggiore di"},"ft,k",null,{"$f":"IF(E99<=L59,\"VERIFICATO!\",\"ARMATURA NECESSARIA!\")","v":"ARMATURA NECESSARIA!"}]
[null,null,null,null,null,null,null,null,null,{"$f":"IF(K99=\"ARMATURA NECESSARIA!\",\"Controllare (*) VERIFICA ARMATURA\",\"CLS TESO OK!\")","v":"Controllare (*) VERIFICA ARMATURA"}]
["Soll. normali in trave: - Compressione",null,null,"s2",{"$f":"($E$79*10^3)/($E$24*$E$25)","v":1.1777464151641486},"N/mm2"]
["                                            - Flessione",null,null,"sm,2",{"$f":"(0.5*$E$25*$E$77*10^6)/($E$24*$E$25^3/12)","v":5.6905328055642856},"N/mm2"]
["Verifica tensoflessione:(s2/ft,0,d) + (sm,2/fm,y,d)= ",null,null,null,{"$f":"E101/L53+E102/L52","v":0.54093426799756417},"-",null,{"$f":"IF(E103<=I103,\"minore di\",\"maggiore di\")","v":"minore di"},1,null,{"$f":"IF(E103<=I103,\"VERIFICATO!\",\"RICONTROLLARE!\")","v":"VERIFICATO!"}]
[]
["Sollecitazione tagliante nella trave:",null,null,"t2,max",{"$f":"0.5*($E$55*($E$25/2+$E$216)^2/$L$216)*($E$80*10^3)","v":0.40748529736111727},"N/mm2",null,{"$f":"IF(E105<=L54,\"minore di\",\"maggiore di\")","v":"minore di"},"fV,d",null,{"$f":"IF(E105<=L54,\"VERIFICATO!\",\"RICONTROLLARE!\")","v":"VERIFICATO!"}]
[]
["Azione agente sulla connessione:",null,null,"Fconn",{"$f":"((L214*E215*E204*E47)/L216)*(E80)","v":4.8166391025084909},"kN",null,{"$f":"IF(E107<=I107,\"minore di Rd =\",\"maggiore di Rd =\")","v":"minore di Rd ="},{"$f":"IF(Prescrizioni!B67=1,Analisi!L281,Analisi!E281)","v":5.7558951749274199},"kN",{"$f":"IF(E107<=I107,\"VERIFICATO!\",\"RICONTROLLARE!\")","v":"VERIFICATO!"}]
["VERIFICA DELLE SOLLECITAZIONI ALLO SLU A TEMPO t=¥"]
["Soll. normali nel cls: - Compressione",null,null,"s1",{"$f":"L78*10^3/(E20*E21+E24*E26)","v":1.1772380257259711},"N/mm2"]
["                                          - Flessione sup.",null,null,"sm,sup,1",{"$f":"(E21+E26-L200)*(L76*10^6)/((($E$24*$E$26^3/12)+$E$26*$E$24*($L$200-$E$26/2)^2+($E$20*$E$21^3/12)+$E$20*$E$21*($L$200-$E$21/2)^2))","v":2.2032534925197318},"N/mm2",null,null,"-Flessione inf.",null,"sm,inf,1",{"$f":"(L200)*(L76*10^6)/((($E$24*$E$26^3/12)+$E$26*$E$24*($L$200-$E$26/2)^2+($E$20*$E$21^3/12)+$E$20*$E$21*($L$200-$E$21/2)^2))","v":2.2032534925197318},"N/mm2"]
["Tens. normale:lembo sup. compresso:",null,null,"s1,C",{"$f":"E110+E109","v":3.3804915182457029},"N/mm2",null,{"$f":"IF(E111<=L58,\"minore di\",\"maggiore di\")","v":"minore di"},"fc,k",null,{"$f":"IF(E111<=L58,\"VERIFICATO!\",\"RICONTROLLARE!\")","v":"VERIFICATO!"}]
["Tens. normale: lembo inferiore teso:",null,null,"s1,T",{"$f":"L110-E109","v":1.0260154667937607},"N/mm2",null,{"$f":"IF(E112<=L59,\"minore di\",\"maggiore di\")","v":"minore di"},"ft,k",null,{"$f":"IF(E112<=L59,\"VERIFICATO!\",\"ARMATURA NECESSARIA!\")","v":"VERIFICATO!"}]
[null,null,null,null,null,null,null,null,null,{"$f":"IF(K112=\"ARMATURA NECESSARIA!\",\"Controllare (*) VERIFICA ARMATURA\",\"CLS TESO OK!\")","v":"CLS TESO OK!"}]
["Soll. normali in trave: - Compressione",null,null,"s2",{"$f":"L79*10^3/(E24*E25)","v":1.1956323698779394},"N/mm2"]
["                                            - Flessione",null,null,"sm,2",{"$f":"(0.5*E25*L77*10^6)/(E24*E25^3/12)","v":6.0428542681901405},"N/mm2"]
["Verifica tensoflessione:(s2/ft,0,d) + (sm,2/fm,y,d)= ",null,null,null,{"$f":"E114/L53+E115/L52","v":0.56923033121247224},"-",null,{"$f":"IF(E116<=I116,\"minore di\",\"maggiore di\")","v":"minore di"},1,null,{"$f":"IF(E116<=I116,\"VERIFICATO!\",\"RICONTROLLARE!\")","v":"VERIFICATO!"}]
[]
["Sollecitazione tagliante nella trave:",null,null,"t2,max",{"$f":"(0.5*L221*($E$25/2+$E$240)^2/L240)*L80*10^3","v":0.4262088104716325},"N/mm2",null,{"$f":"IF(E118<=L54,\"minore di\",\"maggiore di\")","v":"minore di"},"fV,d",null,{"$f":"IF(E118<=L54,\"VERIFICATO!\",\"RICONTROLLARE!\")","v":"VERIFICATO!"}]
[]
["Azione agente sulla connessione:",null,null,"Fconn",{"$f":"(L238*E228*E239*E47)/L240*L80","v":4.8897874371167829},"kN",null,{"$f":"IF(E120<=I120,\"minore di Rd =\",\"maggiore di Rd =\")","v":"minore di Rd ="},{"$f":"IF(Prescrizioni!B67=1,Analisi!L281,Analisi!E281)","v":5.7558951749274199},null,{"$f":"IF(E120<=I120,\"VERIFICATO!\",\"RICONTROLLARE!\")","v":"VERIFICATO!"}]
["VERIFICA DELLE DEFORMAZIONI ALLO SLU A TEMPO t=0",null,null,null,null,null,null,"VERIFICA DELLE DEFORMAZIONI ALLO SLU A TEMPO t=¥"]
[null,null,null,null,null,null,null,null,null,null,null,null,null,null,null,null,null,null,null,null,null,null,null,null,null,null,null,null,null,null,null,"x t=0 =",null,"mm"]
["Freccia del carico permanente:",null,null,"u0,g",{"$f":"1.1*5/384*((E28+(E29+E30)*L13/1000)*E17^4/L211)+1.1*((E31*10^3/3)*(E18^2*(E17-E18)^2)/(L211*E17))","v":4.6633110999976592},"mm",null,"Freccia del carico permanente:",null,null,"u¥,g",{"$f":"1.1*5/384*((E28+(E29+E30)*L13/1000)*E17^4/L235)+1.1*((E31*10^3/3)*(E18^2*(E17-E18)^2)/(L235*E17))","v":7.9714844428472711},"mm",null,null,null,null,null,null,null,null,null,null,null,null,null,null,null,null,null,null,"x t=00 =",null,"mm"]
["Freccia del carico variabile:",null,null,"u0,q",{"$f":"VLOOKUP(Prescrizioni!B32,Prescrizioni!B24:G30,6)*1.1*5/384*(((E33)*L13/1000)*E17^4/L211)","v":0.63089857737506072},"mm",null,"Freccia del carico variabile:",null,null,"u¥,q",{"$f":"VLOOKUP(Prescrizioni!B32,Prescrizioni!B24:G30,6)*(1.1*5/384*(((E33)*L13/1000)*E17^4/L235))","v":1.0784607946405926},"mm"]
[]
["Freccia totale:",null,null,"u0,tot",{"$f":"SUM(E123:E124)","v":5.2942096773727201},"mm",null,"Freccia totale:",null,null,"u¥,tot",{"$f":"SUM(L123:L124)","v":9.0499452374878633},"mm"]
[null,null,null,"L/u0",{"$f":"FLOOR(E17/E126,1)","v":922},"-",null,null,null,null,"L/u¥",{"$f":"FLOOR(E17/L126,1)","v":539},"-"]
[null,null,null,{"$f":"IF(E127>=L14,\"VERIFICATO!\",\"RICONTROLLARE!\")","v":"VERIFICATO!"},null,null,null,null,null,null,{"$f":"IF(L127>=L15,\"VERIFICATO!\",\"RICONTROLLARE!\")","v":"VERIFICATO!"}]
["NB: Prima dell'esecuzione tutti i calcoli devono essere verificati e approvati dal progettista responsabile delle strutture."]
[{"$f":"CONCATENATE('SOFTWARE T-CON'!$A$11,'SOFTWARE T-CON'!$Y$17,'SOFTWARE T-CON'!$C$11)","v":"Tecnico:  Ufficio Tecnico"},null,null,null,{"$f":"CONCATENATE(\"Versione \",'SOFTWARE T-CON'!AD7)","v":"Versione 2.8.2"},null,null,null,null,null,null,"Pagina 2/3"]
[]
[]
[]
[]
[]
["(*) VERIFICA DELL'ARMATURA DELLA SOLETTA t=0"]
["Momento max agente sulla soletta:",null,null,"M1,max",{"$f":"MAX(E76,L76)","v":1.5171941410476326},"kNm",null,"Area di armatura prevista per m.l.:",null,null,"As/ml",{"$f":"L63","v":141.37166941154069},"mm2/m"]
["Area di armatura minima:",null,null,"As,min",{"$f":"E137*10^6/(0.9*E65*L64)","v":143.60273763002283},"mm2",{"$f":"IF(E138<=L138,\"<\",\">\")","v":">"},"Area di armatura prevista:",null,null,"As",{"$f":"L63*L13/1000","v":91.89158511750145},"mm2"]
[]
["Tens.max flessione soletta/isolante:",null,null,"sm,1 - sol/iso",{"$f":"IF(E144=0,0,E144*(E76*10^6)/((($E$24*$E$26^3/12)+$E$26*$E$24*($L$200-$E$26/2)^2+($E$20*$E$21^3/12)+$E$20*$E$21*($L$200-$E$21/2)^2)))","v":3.8902413873016215},"N/mm2",null,"Area minima di acciaio:",null,null,"Amin",{"$f":"ABS(E145/(E64/L65))","v":68.037802514904953},"mm2"]
["Tens.max trazione soletta/isolante:",null,null,"s1 - sol/iso",{"$f":"E140-E96","v":2.7306141477553831},"N/mm2",null,"Passo tondi:",null,null,"P.T.",{"$f":"VLOOKUP('Caratteristiche Materiali'!O48,'Caratteristiche Materiali'!O41:T47,5)","v":200},"mm"]
["Asse neutro tensioni nel cls:",null,null,"x = yG,CLS",{"$f":"L200","v":30},"mm",null,"Numero tondi nell'interasse coll.:",null,null,"Nt",{"$f":"E20/L141","v":3.25},"-"]
["Altezza isolante:",null,null,"hisolante",{"$f":"E26","v":0},"mm",null,"Area barra rete e.s.:",null,null,"As,d",{"$f":"VLOOKUP('Caratteristiche Materiali'!O48,'Caratteristiche Materiali'!O42:T47,6)","v":28.274333882308138},"mm2"]
["Altezza cls teso in soletta:",null,null,"x - hisolante",{"$f":"IF(E143>E142,0,E142-E143)","v":30},"mm",null,"Rete disposta:",null,null,"AS,d",{"$f":"L142*L143","v":91.89158511750145},"mm2"]
["Trazione in rete elettrosaldata:",null,null,"Ft,l",{"$f":"E141*E144/2*E20","v":26623.487940614985},"N",null,null,null,null,{"$f":"IF(E145<=0,\"ARMATURA NON NECESSARIA\",IF(L144>=L140,\"VERIFICATO\",\"ARMATURA NON SUFFICIENTE\"))","v":"VERIFICATO"}]
["(*) VERIFICA DELL'ARMATURA LONGITUDINALE DEL CORDOLO NEL CASO DI TAVOLATO INTERROTTO / PRESENZA DI ISOLANTE t=0"]
["Tens.max trazione CLS:",null,null,"s1,T",{"$f":"E99","v":2.7306141477553831},"N/mm2",null,"Area minima di acciaio",null,null,"Amin,l",{"$f":"ABS(E147*L200/2*E148/(E64/L65))","v":16.747766772899681},"mm2"]
["Larghezza cordolo in calcestruzzo:",null,null,"Biso",{"$f":"E24","v":160},"mm",null,"Area di progetto impiegata",null,null,"As,c,d",{"$f":"VLOOKUP('Caratteristiche Materiali'!V9,'Caratteristiche Materiali'!V5:X8,3)*VLOOKUP('Caratteristiche Materiali'!V15,'Caratteristiche Materiali'!V12:W14,2)","v":0},"mm2"]
[null,null,null,null,null,null,null,null,null,null,{"$f":"IF('SOFTWARE T-CON'!E30=0,\"ARMATURA NON NECESSARIA\",IF(L148>=L147,\"VERIFICATO\",\"ARMATURA NON SUFFICIENTE\"))","v":"ARMATURA NON NECESSARIA"}]
["(*) VERIFICA DELL'ARMATURA DELLA SOLETTA t=¥"]
["Tens.max flessione soletta/isolante:",null,null,"sm,1 - sol/iso",{"$f":"IF(E155=0,0,E155*L76*10^6/((($E$24*$E$26^3/12)+$E$26*$E$24*($L$200-$E$26/2)^2+($E$20*$E$21^3/12)+$E$20*$E$21*($L$200-$E$21/2)^2)))","v":2.2032534925197318},"N/mm1",null,"Area minima di acciaio:",null,null,"Amin",{"$f":"ABS(E156/(E64/L65))","v":25.564885380944531},"mm2"]
["Tens.max trazione soletta/isolante:",null,null,"s1 - sol/iso",{"$f":"E151-E109","v":1.0260154667937607},"N/mm2",null,"Passo tondi:",null,null,"P.T.",{"$f":"L141","v":200},"mm"]
["Asse neutro tensioni nel cls:",null,null,"x = yG,CLS",{"$f":"E142","v":30},"mm",null,"Numero tondi nell'interasse coll.:",null,null,"Nt",{"$f":"E20/L141","v":3.25},"-"]
["Altezza isolante:",null,null,"hisolante",{"$f":"E143","v":0},"mm",null,"Area barra rete e.s.:",null,null,"As,d",{"$f":"L143","v":28.274333882308138},"mm2"]
["Altezza cls teso in soletta:",null,null,"x - hisolante",{"$f":"E144","v":30},"mm",null,"Rete disposta:",null,null,"AS,d",{"$f":"L144","v":91.89158511750145},"mm2"]
["Trazione in rete elettrosaldata:",null,null,"Ft,l",{"$f":"E155*E152/2*E20","v":10003.650801239166},"N",null,null,null,null,{"$f":"IF(E156<=0,\"ARMATURA NON NECESSARIA\",IF(L155>=L151,\"VERIFICATO\",\"ARMATURA NON SUFFICIENTE\"))","v":"VERIFICATO"}]
["(*) VERIFICA DELL'ARMATURA LONGITUDINALE DEL CORDOLO NEL CASO DI TAVOLATO INTERROTTO / PRESENZA DI ISOLANTE  t=¥"]
["Tens.max trazione CLS:",null,null,"s1,T",{"$f":"E112","v":1.0260154667937607},"N/mm2",null,"Area minima di acciaio",null,null,"Amin,l",{"$f":"ABS(E158*L200/2*E159/(E64/L65))","v":6.292894863001731},"mm2"]
["Larghezza cordolo in calcestruzzo:",null,null,"Biso",{"$f":"E148","v":160},"mm",null,"Area di progetto impiegata",null,null,"As,c,d",{"$f":"L148","v":0},"mm2"]
[null,null,null,null,null,null,null,null,null,null,{"$f":"IF('SOFTWARE T-CON'!E30=0,\"ARMATURA NON NECESSARIA\",IF(L159>=L158,\"VERIFICATO\",\"ARMATURA NON SUFFICIENTE\"))","v":"ARMATURA NON NECESSARIA"}]
[]
[]
[]
[]
[null,null,null,null,null,null,null,null,null,null,null,null,null,"Il presente foglio non può essere modificato e/o distributo in alcun modo senza il consenso scritto di RoofRox Srl."]
[]
[]
[]
[]
[]
[]
[]
[]
[]
[]
[]
[]
[]
[]
[]
[]
[]
[]
[]
[]
[]
[]
[]
[]
[]
[]
[]
[]
[]
["NB: Prima dell'esecuzione tutti i calcoli devono essere verificati e approvati dal progettista responsabile delle strutture."]
[{"$f":"CONCATENATE('SOFTWARE T-CON'!$A$11,'SOFTWARE T-CON'!$Y$17,'SOFTWARE T-CON'!$C$11)","v":"Tecnico:  Ufficio Tecnico"},null,null,null,{"$f":"E130","v":"Versione 2.8.2"},null,null,null,null,null,null,"Pagina 3/3"]
[]
["DATI A TEMPO t=0"]
["Dati base della sezione"]
["Distanza tra i baricentri L/cls:",null,null,"a",{"$f":"$L$200+$E$23+$E$25/2","v":170},"mm",null,"Baricentro sezione in cls",null,null,"yG,CLS",{"$f":"((E24*E26)*E26/2+(E21*E20)*(E26+E21/2))/(E24*E26+E21*E20)","v":30},"mm"]
["Posizione del baricentro:",null,null,"yG,¥",{"$f":"$E$25/2+(E204*E200)/(E203+E204)","v":244.99386604804653},"mm"]
[]
["Rigidezza assiale sezione lignea:",null,null,"E2A2",{"$f":"E55*($E$24*$E$25)","v":441600000},"N",null,"Rigidezza flex sezione lignea:",null,null,"E2J2",{"$f":"1/12*((E55*$E$24*$E$25^3))","v":2119680000000},"Nmm2"]
["Rigidezza assiale sezione c.a:",null,null,"E1A1",{"$f":"E60*($E$20*$E$21+$E$24*$E$26)","v":1226439296.1577959},"N",null,"Rigidezza flex sezione c.a.:",null,null,"E1J1",{"$f":"E60*(($E$24*$E$26^3/12)+$E$26*$E$24*($L$200-$E$26/2)^2+($E$20*$E$21^3/12)+$E$20*$E$21*($L$200-$E$21/2)^2)","v":367931788847.33875},"Nmm2"]
["Rigidezza assiale sezione composta:",null,null,"(EA)0",{"$f":"(E203*E204)/(E203+E204)","v":324689948.51069021},"N",null,"Rigidezza flex conn. nulla:",null,null,"(EJ)0",{"$f":"L204+L203","v":2487611788847.3389},"Nmm2"]
[null,null,null,null,null,null,null,"Rigidezza flex conn. rigida:",null,null,"(EJ)¥",{"$f":"L205+E205*E200^2","v":11871151300806.285},"Nmm2"]
[]
["Calcolo della rigidezza efficace allo SLE"]
["Modulo di scorrimento:",null,null,"K=Kser",{"$f":"E44","v":9000},"N/mm",null,"Parametro g1:",null,null,"g1",{"$f":"(1+((PI())^2*E204*E93)/(E46*E209*E17^2))^(-1)","v":8.9643762788172265E-2},"-"]
["Distanza tra baricentri G1-G0:",null,null,"a1",{"$f":"E200-E211","v":136.11277798334132},"mm",null,"Parametro g2:",null,null,"g2",1,"-"]
["Distanza tra baricentri G2-G0:",null,null,"a2",{"$f":"(L209*E204*E200)/(L209*E204+E203)","v":33.88722201665869},"mm",null,"Rigidezza efficace allo SLE:",null,null,"(EJ)ef,SLE",{"$f":"(L203+L204)+(L210*E203*E211^2)+(L209*E204*E210^2)","v":5031593320081.9395},"Nmm2"]
[]
["Calcolo della rigidezza efficace allo SLU"]
["Modulo di scorrimento:",null,null,"Ku",{"$f":"E45","v":6000},"N/mm",null,"Parametro g1:",null,null,"g1",{"$f":"(1+((PI())^2*E204*E93)/(E46*E214*E17^2))^(-1)","v":6.1603292161960602E-2},"-"]
["Distanza tra baricentri G1-G0:",null,null,"a1",{"$f":"E200-E216","v":145.1640883817586},"mm",null,"Parametro g2:",null,null,"g2",1,"-"]
["Distanza tra baricentri G2-G0:",null,null,"a2",{"$f":"(L214*E200*E204)/(L214*E204+E203)","v":24.835911618241386},"mm",null,"Rigidezza efficace allo SLU:",null,null,"(EJ)ef,SLU",{"$f":"(L204+L203)+(L215*E203*E216^2)+(L214*E204*E215^2)","v":4352093345851.9561},"Nmm2"]
[]
["Efficienza del sistema allo SLE:",null,null,"hSLE",{"$f":"(L211-$L$205)/($L$206-$L$205)","v":0.27111107999197936},null,null,"Efficienza del sistema allo SLU:",null,null,"hSLU",{"$f":"(L216-$L$205)/($L$206-$L$205)","v":0.19869704333086785},"-"]
[]
["DATI A TEMPO t=¥"]
["Modulo elastico cls a t=¥",null,null,"E1,¥",{"$f":"$E$60/(1+$E$61*$L$37)","v":10482.387146647829},"N/mm2",null,"Modulo elastico legno a t=¥",null,null,"E2,¥",{"$f":"$E$55/(1+$L$38*$L$37)","v":7187.5},"N/mm2"]
[]
["Dati base della sezione"]
["Distanza tra i baricentri L/cls:",null,null,"a",{"$f":"E200","v":170},"mm"]
["Posizione del baricentro:",null,null,"yG,¥",{"$f":"$E$25/2+(E228*E224)/(E227+E228)","v":221.48495540206576},"mm"]
[]
["Rigidezza assiale sezione lignea:",null,null,"E2A2",{"$f":"L221*($E$24*$E$25)","v":276000000},"N",null,"Rigidezza flex sezione lignea:",null,null,"E2J2",{"$f":"1/12*((L221*$E$24*$E$25^3))","v":1324800000000},"Nmm2"]
["Rigidezza assiale sezione c.a:",null,null,"E1A1",{"$f":"E221*($E$20*$E$21+$E$24*$E$26)","v":408813098.71926534},"N",null,"Rigidezza flex sezione c.a.:",null,null,"E1J1",{"$f":"E221*(($E$24*$E$26^3/12)+$E$26*$E$24*($L$200-$E$26/2)^2+($E$20*$E$21^3/12)+$E$20*$E$21*($L$200-$E$21/2)^2)","v":122643929615.77959},"Nmm2"]
["Rigidezza assiale sezione composta:",null,null,"(EA)0",{"$f":"(E227*E228)/(E227+E228)","v":164763809.94688326},"N",null,"Rigidezza flex conn. nulla:",null,null,"(EJ)0",{"$f":"L228+L227","v":1447443929615.7795},"Nmm2"]
[null,null,null,null,null,null,null,"Rigidezza flex conn. rigida:",null,null,"(EJ)¥",{"$f":"L229+E229*E224^2","v":6209118037080.7051},"Nmm2"]
[]
["Calcolo della rigidezza efficace allo SLE"]
["Modulo di scorrimento:",null,null,"K=Kser",{"$f":"$E$44/(1+$L$38)","v":5625},"N/mm",null,"Parametro g1:",null,null,"g1",{"$f":"(1+((PI())^2*$E$228*$E$93)/(E46*E233*$E$17^2))^(-1)","v":0.15585690568125746},"-"]
["Distanza tra baricentri G1-G0:",null,null,"a1",{"$f":"E224-E235","v":138.11522686557009},"mm",null,"Parametro g2:",null,null,"g2",1,"-"]
["Distanza tra baricentri G2-G0:",null,null,"a2",{"$f":"(L233*E228*E224)/(L233*E228+E227)","v":31.884773134429899},"mm",null,"Rigidezza efficace allo SLE:",null,null,"(EJ)ef,SLE",{"$f":"(L227+L228)+(L234*E227*E235^2)+(L233*E228*E234^2)","v":2943477485083.2305},"Nmm2"]
[]
["Calcolo della rigidezza efficace allo SLU"]
["Modulo di scorrimento:",null,null,"Ku",{"$f":"$E$45/(1+$L$38*$L$37)","v":3750},"N/mm",null,"Parametro g1:",null,null,"g1",{"$f":"(1+((PI())^2*$E$228*$E$93)/(E46*E238*$E$17^2))^(-1)","v":0.10959849804504289},"-"]
["Distanza tra baricentri G1-G0:",null,null,"a1",{"$f":"E224-E240","v":146.25693455150551},"mm",null,"Parametro g2:",null,null,"g2",1,"-"]
["Distanza tra baricentri G2-G0:",null,null,"a2",{"$f":"(L238*E224*E228)/(L238*E228+E227)","v":23.743065448494484},"mm",null,"Rigidezza efficace allo SLU:",null,null,"(EJ)ef,SLU",{"$f":"(L228+L227)+(L239*E227*E240^2)+(L238*E228*E239^2)","v":2561468560459.1406},"Nmm2"]
[]
["Efficienza del sistema allo SLE:",null,null,"hSLE",{"$f":"(L235-$L$229)/($L$230-$L$229)","v":0.31418226483036787},null,null,"Efficienza del sistema allo SLU:",null,null,"hSLU",{"$f":"(L240-$L$229)/($L$230-$L$229)","v":0.23395650472948015},"-"]
[]
[]
[]
[]
[]
[]
[]
[]
[]
[]
[]
[]
[]
["RESISTENZA DEL CONNETTORE"]
["Caratteristiche della connessione:"]
["Densità caratteristica del legname:",null,null,"rk",{"$f":"VLOOKUP('Caratteristiche Materiali'!$B$33,'Caratteristiche Materiali'!$B$9:$O$30,13)","v":385},"kg/m3",null,"Lunghezza parte filettata nel legno:",null,null,"Lwood",{"$f":"$L$45-$E$23/SIN($E$267)+$L$261","v":115.7157287525381},"mm"]
["Diametro efficace del connettore:",null,null,"def",{"$f":"VLOOKUP('Caratteristiche Materiali'!$B$60,'Caratteristiche Materiali'!$B$58:$U$59,14)","v":5.83},"mm",null,"Lunghezza efficace della vite:",null,null,"Lef",{"$f":"IF($L$258<=(VLOOKUP('Caratteristiche Materiali'!$B$60,'Caratteristiche Materiali'!$B$58:$R$59,15)),$L$258,VLOOKUP('Caratteristiche Materiali'!$B$60,'Caratteristiche Materiali'!$B$58:$R$59,15))","v":100},"mm"]
["Diametro filettatura esterna:",null,null,"d ",{"$f":"VLOOKUP('Caratteristiche Materiali'!$B$60,'Caratteristiche Materiali'!$B$58:$T$59,3)","v":8},"mm",null,"Lunghezza del tratto nel calstruzzo:",null,null,"Lcls",{"$f":"$L$44-$L$45-$L$261","v":64.849999999999994},"mm"]
["Diametro gambo liscio:",null,null,"dS",{"$f":"VLOOKUP('Caratteristiche Materiali'!$B$60,'Caratteristiche Materiali'!$B$58:$U$59,17)","v":5.9},"mm",null,"Ammorsam. alesatore in tavolato:",null,null,"LA",{"$f":"IF(E23=0,0,IF(Prescrizioni!B67=1,14,10))","v":14},"mm"]
["Tensione di rifollamento // fibre:",null,null,"fh,0,k",{"$f":"0.082*(1-0.01*E260)*E258","v":29.044400000000003},"N/mm2",null,"Ricoprimento della testa del conn.:",null,null,"cS",{"$f":"IF(E26>0,E26+IF(E23=0,IF(Prescrizioni!B67=2,$E$21-$L$260*SIN($E$267)+(VLOOKUP('Caratteristiche Materiali'!B81,'Caratteristiche Materiali'!B65:F80,5))*SIN($E$267),($E$21-$L$260*SIN($E$267)+(VLOOKUP('Caratteristiche Materiali'!B81,'Caratteristiche Materiali'!B65:F80,5))*SIN($E$267)-$E$261/(2*SIN($E$267)))),IF(Prescrizioni!B67=2,$E$21-$L$260*SIN($E$267),($E$21-$L$260*SIN($E$267)-$E$261/(2*SIN($E$267))))),IF(E23=0,IF(Prescrizioni!B67=2,$E$21-$L$260*SIN($E$267)+(VLOOKUP('Caratteristiche Materiali'!B81,'Caratteristiche Materiali'!B65:F80,5))*SIN($E$267),($E$21-$L$260*SIN($E$267)+(VLOOKUP('Caratteristiche Materiali'!B81,'Caratteristiche Materiali'!B65:F80,5))*SIN($E$267)-$E$261/(2*SIN($E$267)))),IF(Prescrizioni!B67=2,$E$21-$L$260*SIN($E$267),($E$21-$L$260*SIN($E$267)-$E$261/(2*SIN($E$267))))))","v":9.9721952310517725},"mm"]
["Tensione di rifollamento generica:",null,null,"fh,alfa,k",{"$f":"$E$262/($E$264*(SIN($E$267))^2+(COS($E$267))^2)","v":23.831791421362492},"N/mm2",null,"Momento caratt. di snervamento:",null,null,"My,k",{"$f":"VLOOKUP('Caratteristiche Materiali'!$B$60,'Caratteristiche Materiali'!$B$58:$X$59,16)","v":22600},"Nmm",null,null,null,null,null,null,null,null,null,"RES45",{"$f":"L259*E260*L264/(1.2*(COS(E267))^2+(SIN(E267))^2)","v":7781.8181818181811}]
["Coefficiente k90",null,null,"k90",{"$f":"1.35+0.015*E259","v":1.4374500000000001},"-",null,"Res. caratt. a estrazione della vite:",null,null,"fax,k,90",{"$f":"VLOOKUP('Caratteristiche Materiali'!$B$60,'Caratteristiche Materiali'!$B$58:$T$59,18)","v":10.7},"N/mm2",null,null,null,null,null,null,null,null,null,null,{"$f":"X263/1000","v":7.7818181818181813}]
["Densità caratteristica del tavolato:",null,null,"rk,tavolato",{"$f":"VLOOKUP('Caratteristiche Materiali'!$B$81,'Caratteristiche Materiali'!$B$65:$D$70,3)","v":550},"kg/m3",null,"Capacità caratt. a trazione del conn.:",null,null,"ftens,k",{"$f":"VLOOKUP('Caratteristiche Materiali'!$B$60,'Caratteristiche Materiali'!$B$58:$T$59,19)","v":22.7},"kN"]
["Tens. rifoll. // fibre tavolato:",null,null,"fh,0,k,tavol.",{"$f":"0.082*(1-0.01*E260)*E265","v":41.492000000000004},"N/mm2",null,"Coeff. parziale di sicurezza unioni:",null,null,"gunioni",{"$f":"VLOOKUP(Prescrizioni!$B$7,Prescrizioni!$B$3:$F$6,5)","v":1.5},"-",null,null,null,null,null,null,null,null,null,null,{"$f":"X264*0.9/1.3","v":5.3874125874125864}]
["Inclinazione connettore in radianti:",null,null,"a",{"$f":"(PI()/180)*VLOOKUP(Prescrizioni!$B$67,Prescrizioni!$B$65:$C$66,2)","v":0.78539816339744828},"rad",null,"kd",null,null,"kd",{"$f":"MIN($E$260/8,1)","v":1},"-",null,null,null,null,null,null,null,null,null,null,{"$f":"X266*L278","v":5.3874125874125864}]
[]
["Resistenza della connessione per viti caricate lateralmente:",null,null,null,null,null,null,"Resistenza della connessione per viti caricate assialmente:"]
[]
["Res. Con ts > 0",null,null,"Rk,II,modo",{"$f":"((E266*E260*E23)*((SQRT((1+4*L263/(E266*E260*E23^2))+(E262/(2*E266))))-1))/10^3","v":2.8219897393292852},"kN",null,"Primo modo di rottura",null,null,"Fax,k,Rk",{"$f":"(100*L259*(E258/350)^0.8)/1000","v":10.792303452988911},"kN"]
[null,null,null,null,null,null,null,"Secondo modo di rottura",null,null,"Ft,Rk",{"$f":"$L$265","v":22.7},"kN"]
["Res. Con ts = 0",null,null,"Rk,III,modo",{"$f":"(SQRT(4*L263*E266*E260))/10^3","v":5.4778658618115141},"kN"]
[]
["Resistenza totale",null,null,"Rk",{"$f":"IF('Caratteristiche Materiali'!B52<=5,IF($E$23=0,$E$273,$E$271),VLOOKUP('Caratteristiche Materiali'!$B$52,'Caratteristiche Materiali'!$B$48:$K$51,8)*IF($E$23=0,$E$273,$E$271))","v":2.8219897393292852},"kN",null,"Resistenza totale",null,null,"Rk",{"$f":"IF('Caratteristiche Materiali'!B52<=5,MIN($L$271:$L$272),VLOOKUP('Caratteristiche Materiali'!$B$52,'Caratteristiche Materiali'!$B$48:$K$51,8)*MIN($L$271:$L$272))","v":10.792303452988911},"kN"]
[]
["Numero di elementi del collegam.",null,null,"nc",{"$f":"$E$46","v":1},"-",null,"Numero di elementi del collegam.",null,null,"nc",{"$f":"$E$46","v":1},"-"]
["Numero efficace",null,null,"nef",{"$f":"MIN(E277,(E277^0.9)*(E47/(13*E259))^0.25)","v":1},"-",null,"Numero efficace",null,null,"nef",{"$f":"L277^0.9","v":1},"-"]
[]
["Resistenza caratteristica totale",null,null,"Rk,tot",{"$f":"E278*E275","v":2.8219897393292852},"kN",null,"Resistenza caratteristica totale",null,null,"Rk,tot",{"$f":"$L$278*$L$275","v":10.792303452988911},"kN"]
["Resistenza finale",null,null,"Rd,tot",{"$f":"$L$40*E280/L266","v":1.5050611943089522},"kN",null,"Resistenza finale",null,null,"Rd,tot",{"$f":"$L$280*$L$40/$L$266","v":5.7558951749274199},"kN"]
[]
[]
[]
[null,null,null,null,null,null,null,{"$f":"VLOOKUP('Caratteristiche Materiali'!$B$52,'Caratteristiche Materiali'!$B$49:$K$51,8)","v":{"$error":"#N/A"}}]

{"sheet":"Relazione","index":2,"n_rows":225,"n_cols":14,"rows_kept":225,"cut":false,"hidden":false,"merged":[[224,0,224,2],[224,6,224,8],[224,13,224,14],[71,0,71,2],[71,13,71,14],[150,0,150,2],[150,13,150,14],[138,11,138,13],[170,4,170,6],[146,9,146,10],[219,1,220,13],[172,4,172,5],[173,4,173,5],[174,4,174,5],[171,4,171,6],[172,8,172,10],[173,8,173,10],[174,8,174,10],[140,9,140,10],[204,1,205,13],[141,3,141,4],[147,3,147,4],[150,6,150,8],[12,4,12,8],[12,9,12,10],[6,0,7,14],[22,4,22,8],[22,9,22,10],[9,3,9,7],[9,13,9,14],[29,4,29,6],[111,6,111,7],[104,10,104,12],[121,10,121,12],[128,6,128,7],[91,11,91,13],[65,4,65,6],[57,4,57,6],[57,11,57,13],[82,6,82,9],[71,6,71,8],[69,8,69,10],[69,11,69,13]]}
[]
[]
[]
[]
[]
[]
["RELAZIONE DI CALCOLO : VERIFICA DI SOLAI MISTI LEGNO-CLS CON CONNETTORI \"T-CON\""]
[]
["Cantiere:",null,null,{"$f":"Analisi!B9","v":0},null,null,null,null,null,null,null,null,"Data:",{"$f":"TODAY()","v":"2018-12-21"}]
["Posizione solaio:",null,null,{"$f":"Analisi!J9","v":"C1"},null,null,null,null,null,null,null,null,"ID interno:"]
[]
[]
[null,null,null,null,"Caratteristiche della connessione: Connettore",null,null,null,null,{"$f":"VLOOKUP('Caratteristiche Materiali'!B60,'Caratteristiche Materiali'!B58:C59,2)","v":"T-CON 8.0x205"}]
[null,null,null,null,"Resistenza caratt. allo snervamento:",null,null,null,"fy,k =",900,"N/mm2"]
[null,null,null,null,"Momento caratt. di snervamento:",null,null,null,"My,k =",{"$f":"Analisi!L263","v":22600},"Nmm"]
[null,null,null,null,"Lunghezza totale del connettore:",null,null,null,"Ltot =",{"$f":"VLOOKUP('Caratteristiche Materiali'!B60,'Caratteristiche Materiali'!B58:E59,4)","v":208.85},"mm"]
[null,null,null,null,"Diametro del connettore:",null,null,null,"d =",{"$f":"VLOOKUP('Caratteristiche Materiali'!B60,'Caratteristiche Materiali'!B58:E59,3)","v":8},"mm"]
[null,null,null,null,"Lunghezza parte filettata nel legno:",null,null,null,"Lwood =",{"$f":"Analisi!L47","v":115.7157287525381},"mm"]
[null,null,null,null,"Lunghezza efficace della vite:",null,null,null,"Lef = ",{"$f":"Analisi!L259","v":100},"mm"]
[null,null,null,null,"Lunghezza del tratto nel calstruzzo:",null,null,null,"Lcls =",{"$f":"Analisi!L46","v":64.849999999999994},"mm"]
[null,null,null,null,"Inclinazione connettore:",null,null,null,"a =",{"$f":"VLOOKUP(Prescrizioni!B67,Prescrizioni!B65:C66,2)","v":45},"°"]
[]
[null,null,null,null,"Resistenza per solai in semplice orditura con",null,null,null,null,{"$f":"IF(Analisi!E23=0,\"tavolato interrotto\",\"tavolato continuo\")","v":"tavolato continuo"}]
[null,null,null,null,"Resist. di progetto singolo connettore",null,null,null,"Rd,1 =",{"$f":"IF(Prescrizioni!B67=1,Analisi!L275,Analisi!E275)*M97/F36","v":5.7558951749274199},"kN"]
[null,null,null,null,"Rigidezza connettore allo SLE:",null,null,null,"Kser =",{"$f":"Analisi!E44","v":9000},"N/mm"]
[null,null,null,null,"Rigidezza connettore allo SLU:",null,null,null,"Ku =",{"$f":"Analisi!E45","v":6000},"N/mm"]
[null,null,null,null,"Numero connettori in una sezione",null,null,null,"nc = ",{"$f":"Analisi!E46","v":1},"-"]
[]
[]
["1 Normativa di riferimento:",null,null,null,{"$f":"Analisi!K10","v":"D.M. 17.01.2018 - Colonna \"A\""},null,null,"+","Certificati ETA 12/0373 e Z-9.1-845"]
[]
["Coefficiente carichi permanente:",null,null,null,"gG =",{"$f":"Analisi!$L$35","v":1.3}]
["Coefficiente carichi variabili:",null,null,null,"gQ =",{"$f":"Analisi!$L$36","v":1.5}]
["Coefficiente di sicurezza legname:",null,null,null,"gM,L =",{"$f":"Analisi!$L$55","v":1.45}]
["Coefficiente di sicurezza cls:",null,null,null,"gM,cls =",{"$f":"Analisi!$L$60","v":1.5}]
["Coefficiente di sicurezza giunzioni:",null,null,null,"gM,U =",{"$f":"Analisi!$L$266","v":1.5}]
["Coefficiente di sicurezza acciaio:",null,null,null,"gM,S =",{"$f":"Analisi!$L$65","v":1.1499999999999999}]
[]
["2 Dati di progetto:"]
[]
[null,"2.1 Caratteristiche geometriche:"]
[]
[null,"Spessore della soletta:",null,null,"h1 =",{"$f":"Analisi!E21","v":60},"mm"]
[null,"Spessore dell'isolante(se presente):",null,null,"hiso =",{"$f":"Analisi!E143","v":0},"mm"]
[null,{"$f":"IF('Caratteristiche Materiali'!B81<=5,\"Spessore assito:\",\"Spessore strato interposto:\")","v":"Spessore assito:"},null,null,"tS =",{"$f":"Analisi!E23","v":20},"mm"]
[null,"Base della sezione lignea:",null,null,"b2 =",{"$f":"Analisi!E24","v":160},"mm"]
[null,"Altezza della sezione lignea:",null,null,"h2 =",{"$f":"Analisi!E25","v":240},"mm"]
[null,"Interassi travi in legno:",null,null,"i = b1 =",{"$f":"Analisi!L13","v":650},"mm"]
[null,"Inclinazione della struttura:",null,null,"pendenza =",{"$f":"VLOOKUP(Prescrizioni!B187,Prescrizioni!B86:F186,2)","v":0},"%"]
[null,"Luce di calcolo:",null,null,"Lcalcolo =",{"$f":"Analisi!E17","v":4882.5},"mm"]
[null,"Diametro dei connettori:",null,null,"d =",{"$f":"Analisi!E260","v":8},"mm"]
[null,"Passo minimo dei connettori:",null,null,"smin =",{"$f":"Analisi!E47","v":130},"mm"]
[null,"Passo massimo dei connettori:",null,null,"smax =",{"$f":"Analisi!E48","v":330},"mm"]
[null,"Passo equivalente:",null,null,"seq =",{"$f":"Analisi!E93","v":180},"mm"]
[null,null,null,null,null,null,null,null,null,null,null,null,null,"Ø"]
[null,"2.2 Caratteristiche dei materiali"]
[]
[null,"Legno:",null,null,{"$f":"VLOOKUP('Caratteristiche Materiali'!B33,'Caratteristiche Materiali'!B5:O32,2)","v":"GL24h"},null,null,null,"Calcestruzzo:",null,null,{"$f":"VLOOKUP('Caratteristiche Materiali'!B52,'Caratteristiche Materiali'!B42:H51,2)","v":"C25/30"}]
[]
[null,"Resistenza caratt. a flessione:",null,null,"fm,k =",{"$f":"Analisi!E52","v":24},"N/mm2",null,"Resistenza caratt. a compressione:",null,null,"fc,k =",{"$f":"Analisi!E58","v":25},"N/mm2"]
[null,"Resistenza caratt. a trazione:",null,null,"ft,0,k =",{"$f":"Analisi!E53","v":19.2},"N/mm2",null,"Resistenza caratt. a trazione:",null,null,"ft,k =",{"$f":"Analisi!E59","v":1.7954747440105308},"N/mm2"]
[null,"Resistenza caratt. a taglio:",null,null,"fV,k =",{"$f":"Analisi!E54","v":3.5},"N/mm2",null,"Modulo elastico:",null,null,"Ecm = E1 =",{"$f":"Analisi!E60","v":31447.161439943484},"N/mm2"]
[null,"Modulo elastico // alle fibre:",null,null,"E0 = E2 =",{"$f":"Analisi!E55","v":11500},"N/mm2",null,"Coeff. di viscosità a t=¥:",null,null,"f =",{"$f":"Analisi!E61","v":2},"-"]
[null,"Massa volumica caratteristica:",null,null,"rg,k =",{"$f":"VLOOKUP('Caratteristiche Materiali'!B33,'Caratteristiche Materiali'!B5:O32,13)","v":385},"kg/m3",null,"Massa volumica caratteristica:",null,null,"rCLS =",{"$f":"100*'Caratteristiche Materiali'!H42","v":2500},"kg/m3"]
[]
[null,{"$f":"IF('Caratteristiche Materiali'!B81>4,\"Strato interposto:\",\"Tavolato:\")","v":"Tavolato:"},null,null,{"$f":"IF('Caratteristiche Materiali'!B81='Caratteristiche Materiali'!B70,\"Interrotte\",IF(Analisi!E23=0,\"Non presente / Interrotto\",VLOOKUP('Caratteristiche Materiali'!B81,'Caratteristiche Materiali'!B65:F80,2)))","v":"Legno di Conifera C24"},null,null,null,"Rete elettrosaldata:",null,null,"Æ",{"$f":"VLOOKUP('Caratteristiche Materiali'!O48,'Caratteristiche Materiali'!O42:R47,2)","v":"6 mm/20x20"}]
[]
[null,"Massa volumica caratteristica:",null,null,"rg,k =",{"$f":"VLOOKUP('Caratteristiche Materiali'!B81,'Caratteristiche Materiali'!B65:F80,3)","v":550},"kg/m3",null,"Resistenza caratt.(Acciaio. B450C):",null,null,"fy,k",450,"N/mm2"]
[]
[null,"Armatura cordolo intradosso calcestruzzo se presente isolante:",null,null,null,null,null,null,{"$f":"IF('Caratteristiche Materiali'!V15=1,\"ARMATURA NON NECESSARIA,\",CONCATENATE(\"n° \",(VLOOKUP('Caratteristiche Materiali'!V15,'Caratteristiche Materiali'!V12:W14,2)),\" \",N55,\" \", (VLOOKUP('Caratteristiche Materiali'!V9,'Caratteristiche Materiali'!V5:X8,2))))","v":"ARMATURA NON NECESSARIA,"},null,null,{"$f":"IF('Caratteristiche Materiali'!V15='Caratteristiche Materiali'!V12,\"ISOLANTE NON PRESENTE\",\"\")","v":"ISOLANTE NON PRESENTE"}]
[null,null,null,null,null,null,null,null,"Resistenza caratt.(Acciaio. B450C):",null,null,"fy,k",{"$f":"IF(F44=0,\"-\",450)","v":"-"},"N/mm2"]
[{"$f":"CONCATENATE('SOFTWARE T-CON'!$A11,'SOFTWARE T-CON'!$Y17,'SOFTWARE T-CON'!$C11)","v":"Tecnico:  Ufficio Tecnico"},null,null,null,null,null,{"$f":"Analisi!E196","v":"Versione 2.8.2"},null,null,null,null,null,null,"Pagina 1/3"]
[]
[]
[]
[]
[]
[]
[]
[null,"2.3 Carichi e combinazione delle azioni"]
[]
[null,{"$f":"IF('SOFTWARE T-CON'!K36=2,\"\",\"Peso specifico di travi in legno e del tavolato usati solamente per calcolare il peso proprio:\")","v":"Peso specifico di travi in legno e del tavolato usati solamente per calcolare il peso proprio:"},null,null,null,null,null,null,null,null,null,"rL = rS =",{"$f":"IF('SOFTWARE T-CON'!K36=2,\"\",5.5)","v":5.5},"kN/m3"]
[null,"Totale dei carichi permamenti strutturali:",null,null,null,{"$f":"IF('SOFTWARE T-CON'!K36=2,\"\",\"=\")","v":"="},"(rL x b2 x h2)/i + (rS x tS) + (rCLS x h1)",null,null,null,{"$f":"IF('SOFTWARE T-CON'!K36=2,\"\",\"=\")","v":"="},"G1,k =",{"$f":"Analisi!E29+Analisi!E28/(Analisi!L13/1000)","v":1.934923076923077},"kN/m2"]
[null,"Totale dei carichi permamenti non strutturali:",null,null,null,"=","Tramezze, sottofondi,tavelle, ...",null,null,null,"=","G2,k =",{"$f":"Analisi!E30","v":2.5},"kN/m2"]
[null,"Totale dei carichi permamenti:",null,null,null,null,null,null,null,null,null,"Gtot,k =",{"$f":"SUM(M83:M84)","v":4.4349230769230772},"kN/m2"]
[null,"Totale carichi variabili:",null,null,null,"=",{"$f":"VLOOKUP(Prescrizioni!B32,Prescrizioni!B24:G30,2)","v":"Cat. A: Amb. ad uso residenziale"},null,null,null,"=","Qk =",{"$f":"Analisi!E33","v":2},"kN/m2"]
[null,"Carico  variabile concentrato (se presente):",null,null,null,null,null,null,null,null,null,"Pk =",{"$f":"'SOFTWARE T-CON'!L12","v":0},"kN"]
[]
[null,"2.3.1 Combinazioni di carico:"]
[]
[null,"N.B.: E' necessario considerare la condizione di carico più gravosa per la verifica flessionale."]
[null,"Nome della combinazione più gravosa:",null,null,null,null,null,null,null,null,null,{"$f":"IF(Analisi!$E$35>Analisi!$E$36,\"SOLO PERMANENTI\",\"PERMANENTI + ACCIDENTALI\")","v":"PERMANENTI + ACCIDENTALI"}]
[null,"Carico distribuito agente sulla trave:",null,null,null,null,null,null,null,null,null,"q =",{"$f":"IF(Analisi!$E$35>Analisi!$E$36,Analisi!$E$35,Analisi!$E$36)","v":6.0225099999999996},"kN/m"]
[null,"Momento massimo in campata agente sulla trave:",null,null,null,null,null,null,null,null,null,"MEd =",{"$f":"Analisi!$E$75","v":17.946181128585938},"kN"]
[null,"Taglio massimo all'appoggio:",null,null,null,null,null,null,null,null,null,"VEd =",{"$f":"Analisi!$E$80","v":14.702452537499999},"kN"]
[null,"Coefficiente di deformabilità differita:",null,null,null,null,null,null,null,null,null,"kdef =",{"$f":"Analisi!$L$38","v":0.6},"-"]
[null,"Coefficiente di resistenza differita:",null,null,null,null,null,null,null,null,null,"kmod =",{"$f":"Analisi!$L$40","v":0.8},"-"]
[]
["3 Verifche di resistenza:"]
[]
[null,null,null,"VERIFICHE A TEMPO t = 0"]
[]
[null,"CLS:",null,"Verifica tensione normale al lembo superiore compresso:",null,null,null,null,null,"s1,C =",{"$f":"Analisi!E98","v":5.0498686268478599},{"$f":"IF(K103<M103,\"<\",IF(K103=M103,\"=\",\">\"))","v":"<"},{"$f":"Analisi!L58","v":14.166666666666666},"N/mm2"]
[null,null,null,"Verifica tensione normale al lembo inferiore teso:",null,null,null,null,null,"s1,T =",{"$f":"Analisi!E99","v":2.7306141477553831},{"$f":"IF(K104<M104,\"<\",IF(K104=M104,\"=\",\">\"))","v":">"},{"$f":"Analisi!L59","v":1.1969831626736871},"N/mm2"]
[null,null,null,null,null,null,null,null,null,null,{"$f":"IF(K104>M104,\"ARMATURA NECESSARIA\",\"CLS TESO OK\")","v":"ARMATURA NECESSARIA"}]
[]
[null,"ARMATURA SOLETTA:",null,{"$f":"IF(K104>M104,\"Per la verifica dell'armatura della soletta si rimanda al foglio VERIFICA ARMATURA\",\"Armatura minima per la ripartizione dei carichi\")","v":"Per la verifica dell'armatura della soletta si rimanda al foglio VERIFICA ARMATURA"}]
[]
[null,"LEGNO:",null,"Verifica a tensoflessione:",null,null,null,null,null,"h =",{"$f":"Analisi!E103","v":0.54093426799756417},"<",{"$f":"Analisi!I103","v":1},"-"]
[null,null,null,"Verifica delle tensioni tangenziali:",null,null,null,null,null,"t2,max =",{"$f":"Analisi!E105","v":0.40748529736111727},"<",{"$f":"Analisi!L54","v":1.931034482758621},"N/mm2"]
[]
[null,"CONNETTORE:",null,"Resistenza di progetto totale =",null,null,"nef x Rd,conn,1",null,"=",null,null,"Rd,tot =",{"$f":"Analisi!I107","v":5.7558951749274199},"kN"]
[null,null,null,"Numero di connettori efficace:",null,null,null,null,null,null,null,"nef =",{"$f":"IF(Prescrizioni!B67=1,Analisi!L278,Analisi!E278)","v":1},"-"]
[]
[null,null,null,"Forza sul connettore:",null,null,null,null,null,"Fconn =",{"$f":"Analisi!E107","v":4.8166391025084909},{"$f":"IF(K115<M115,\"<\",IF(K115=M115,\"=\",\">\"))","v":"<"},{"$f":"Analisi!I107","v":5.7558951749274199},"kN"]
[]
[]
[null,null,null,"VERIFICHE A TEMPO t = ¥"]
[]
[null,"CLS:",null,"Verifica tensione normale al lembo superiore compresso:",null,null,null,null,null,"s1,C =",{"$f":"Analisi!E111","v":3.3804915182457029},{"$f":"IF(K120<M120,\"<\",IF(K120=M120,\"=\",\">\"))","v":"<"},{"$f":"Analisi!L58","v":14.166666666666666},"N/mm2"]
[null,null,null,"Verifica tensione normale al lembo inferiore teso:",null,null,null,null,null,"s1,T =",{"$f":"Analisi!E112","v":1.0260154667937607},{"$f":"IF(K121<M121,\"<\",IF(K121=M121,\"=\",\">\"))","v":"<"},{"$f":"Analisi!L59","v":1.1969831626736871},"N/mm2"]
[null,null,null,null,null,null,null,null,null,null,{"$f":"IF(K121>M121,\"ARMATURA NECESSARIA\",\"CLS TESO OK\")","v":"CLS TESO OK"}]
[]
[null,"ARMATURA SOLETTA:",null,{"$f":"IF(K121>M121,\"Per la verifica dell'armatura della soletta si rimanda al foglio VERIFICA ARMATURA\",\"Armatura minima per la ripartizione dei carichi\")","v":"Armatura minima per la ripartizione dei carichi"}]
[]
[null,"LEGNO:",null,"Verifica a tensoflessione:",null,null,null,null,null,"h =",{"$f":"Analisi!E116","v":0.56923033121247224},"<",{"$f":"Analisi!I103","v":1},"-"]
[null,null,null,"Verifica delle tensioni tangenziali:",null,null,null,null,null,"t2,max =",{"$f":"Analisi!E118","v":0.4262088104716325},"<",{"$f":"Analisi!L54","v":1.931034482758621},"N/mm2"]
[]
[null,"CONNETTORE:",null,"Resistenza di progetto totale =",null,null,"nef x Rd,conn,1",null,"=",null,null,"Rd,tot =",{"$f":"Analisi!I107","v":5.7558951749274199},"kN"]
[null,null,null,"Numero di connettori efficace:",null,null,null,null,null,null,null,"nef =",{"$f":"IF(Prescrizioni!B67=1,Analisi!L278,Analisi!E278)","v":1},"-"]
[]
[null,null,null,"Forza sul connettore:",null,null,null,null,null,"Fconn =",{"$f":"Analisi!E120","v":4.8897874371167829},{"$f":"IF(K132<M132,\"<\",IF(K132=M132,\"=\",\">\"))","v":"<"},{"$f":"Analisi!I107","v":5.7558951749274199},"kN"]
[]
[]
["4 Verifiche di deformazione:"]
[]
[null,null,null,"VERIFICHE A TEMPO t = 0"]
[]
[null,null,null,"Destinazione d'uso, tipologia di carico in esercizio:",null,null,null,null,null,null,null,{"$f":"VLOOKUP(Prescrizioni!B32,Prescrizioni!B24:G30,2)","v":"Cat. A: Amb. ad uso residenziale"}]
[null,null,null,"Coefficiente di combinazione quasi permanente:",null,null,null,null,null,null,null,"y21 =",{"$f":"VLOOKUP(Prescrizioni!B32,Prescrizioni!B24:G30,6)","v":0.3},"-"]
[null,null,null,"Freccia totale istantanea in combinazione Q.P.:",null,null,null,null,"=","ug,ist + y21 x uq,ist =",null,"utot,ist =",{"$f":"Analisi!E126","v":5.2942096773727201},"mm"]
[null,null,null,"Limite di freccia = L /",null,{"$f":"'SOFTWARE T-CON'!E20","v":400},null,null,null,null,null,"L /",{"$f":"Analisi!E127","v":922},"-"]
[]
[null,null,null,"VERIFICHE A TEMPO t = ¥"]
[]
[null,null,null,"Coefficiente di combinazione quasi permanente:",null,null,null,null,null,null,null,"y21 =",{"$f":"VLOOKUP(Prescrizioni!B32,Prescrizioni!B24:G30,6)","v":0.3},"-"]
[null,null,null,"Freccia totale istantanea in combinazione Q.P.:",null,null,null,null,"=","ug,ist + y21 x uq,ist =",null,"utot,ist =",{"$f":"Analisi!L126","v":9.0499452374878633},"mm"]
[null,null,null,"Limite di freccia = L /",null,{"$f":"'SOFTWARE T-CON'!E21","v":300},null,null,null,null,null,"L /",{"$f":"Analisi!L127","v":539},"-"]
[]
[]
[{"$f":"CONCATENATE('SOFTWARE T-CON'!$A$11,'SOFTWARE T-CON'!$Y$17,'SOFTWARE T-CON'!$C$11)","v":"Tecnico:  Ufficio Tecnico"},null,null,null,null,null,{"$f":"Analisi!E196","v":"Versione 2.8.2"},null,null,null,null,null,null,"Pagina 2/3"]
[]
[]
[]
[]
[]
[]
[]
["5 Risultati della progettazione:"]
[]
[null,"Superficie totale solaio:",null,null,null,null,null,null,null,null,null,"Atot =",{"$f":"IF('SOFTWARE T-CON'!E18=\"-\",\"-\",Analisi!E82)","v":"-"},"m2"]
[null,"Numero di connettori per trave:",null,null,null,null,null,null,null,null,null,"nc,trave =",{"$f":"Analisi!E83","v":26},"-"]
[null,null,null,null,null,null,null,null,null,null,null,"=",{"$f":"M162/Analisi!E46","v":26},{"$f":"IF(Analisi!E46=1,\"-\",IF(Analisi!E46=2,\"coppie\",\"terne\"))","v":"-"}]
[null,"Numero di connettori totale:",null,null,null,null,null,null,null,null,null,"nc,totale =",{"$f":"IF('SOFTWARE T-CON'!E18=\"-\",M162,Analisi!L83)","v":26},"-"]
[null,"Incidenza al metro quadro:",null,null,null,null,null,null,null,null,null,"incidenza =",{"$f":"IF('SOFTWARE T-CON'!E18=\"-\",\"-\",Analisi!L84)","v":"-"},"conn/m2"]
[null,"Distanza dei connettori di estremità dal bordo della trave in legno:",null,null,null,null,null,null,null,null,null,"a3 =",{"$f":"Analisi!E85","v":116.25},"mm"]
[null,{"$f":"IF(Analisi!E47=Analisi!E48,\"\",\"Scarto tra i connettori a passo minimo e quelli a passo massimo:\")","v":"Scarto tra i connettori a passo minimo e quelli a passo massimo:"},null,null,null,null,null,null,null,null,null,{"$f":"IF(Analisi!E47=Analisi!E48,\"\",\"scarto =\")","v":"scarto ="},{"$f":"IF(Analisi!E47=Analisi!E48,\"\",Foglio1!I12)","v":130},{"$f":"IF(Analisi!E47=Analisi!E48,\"\",\"mm\")","v":"mm"}]
[]
["6 Diagramma per la disposizione dei connettori"]
[]
[null,null,null,null,"Luce di calcolo delle travi",null,null,"=",{"$f":"Analisi!E17","v":4882.5},"mm"]
[null,null,null,null,"Numero totale dei connettori",null,null,"=",{"$f":"M162","v":26}]
[null,null,null,{"$f":"IF(Analisi!E47=Analisi!E48,\"\",Analisi!Q85)","v":9},{"$f":"IF(Analisi!E47=Analisi!E48,\"\",IF($N$163=\"-\",\"Connettori a passo\",IF($N$163=\"coppie\",\"Coppie a passo\",\"Terne a passo\")))","v":"Connettori a passo"},null,{"$f":"IF(Analisi!E47=Analisi!E48,\"\",Analisi!E47)","v":130},{"$f":"IF(Analisi!E47=Analisi!E48,\"\",\"mm\")","v":"mm"},{"$f":"IF(Analisi!E47=Analisi!E48,\"\",\" nel primo 25% di trave\")","v":" nel primo 25% di trave"}]
[null,null,null,{"$f":"Analisi!Q84","v":8},{"$f":"IF($N$163=\"-\",\"Connettori a passo\",IF($N$163=\"coppie\",\"Coppie a passo\",\"Terne a passo\"))","v":"Connettori a passo"},null,{"$f":"Analisi!E48","v":330},"mm",{"$f":"IF(Analisi!E47=Analisi!E48,\" lungo tutta la trave\",\" nel tratto centrale di trave\")","v":" nel tratto centrale di trave"}]
[null,null,null,{"$f":"D173","v":9},{"$f":"E173","v":"Connettori a passo"},null,{"$f":"G173","v":130},{"$f":"H173","v":"mm"},{"$f":"I173","v":" nel primo 25% di trave"}]
[]
[]
[]
[]
[]
[]
[]
[]
[]
[]
[]
[]
[]
[]
["7 Avvertenze:"]
[]
[null,"7.1 FASE DI GETTO"]
[]
[null,"•  Puntellare efficacemente il solaio prima del getto e mantenere i puntelli fino a completa maturazione del calcestruzzo."]
[]
[null,"7.2 ARMATURA DELLA SOLETTA"]
[]
[null,"•  L'armatura della soletta dovrà essere realizzata con rete elettrosaldata come specificato;"]
[null,"•  Sovrappore i fogli di rete elettrosaldata di almeno una maglia;"]
[null,"•  Tenere l'armatura sollevata dal piano durante la fase di getto;"]
[null,"•  Copriferro per l'armatura:    s =",null,null,{"$f":"Analisi!E65","v":30},"mm"]
[]
[null,"7.3 ARMATURA PERIMETRALE"]
[]
[null,"•  Si consiglia di collegare la futura soletta alle murature perimetrali alloggiando in esse un'armatura tipo \"coda di rondine\" calcolata a cura del Vostro responsabile delle strutture."]
[]
[]
[null,"7.4 CONNETTORI"]
[]
[null,"•  Per la posa in opera dei connettori non è necessario eseguire il preforo;"]
[null,"•  Il posizionamento degli elementi di connessione dovrà essere effettuato come da disposizioni della Direzione Lavori."]
[]
[null,"7.5 STRUTTURA LIGNEA"]
[]
[null,"•  Eventuale verifica a compressione ortogonale alle fibre all'appoggio è da svolgersi separtamente."]
[]
["8 Disclaimer:"]
[]
[null,"La presente relazione di calcolo è stata redatta in conformità alle normative vigenti alla data della stessa."]
[null,"La presente relazione di calcolo non costituisce documento esecutivo ed è redatta al solo fine indicativo sulla base di dati forniti. La presente dovrà essere sempre conformata dal Vs. tecnico responsabile delle strutture o da tecnico abilitato."]
[]
[null,"I calcoli qui riportati dovranno essere IN OGNI CASO controllati e approvati dal Vostro tecnico responsabile delle strutture. "]
[null,"La società Roofrox Srl declina ogni responsabilità per utilizzi impropri del presente software di calcolo. "]
[null,"Il presente foglio non può essere modificato e/o distributo in alcun modo senza il consenso scritto di RoofRox Srl."]
[{"$f":"CONCATENATE('SOFTWARE T-CON'!$A$11,'SOFTWARE T-CON'!$Y$17,'SOFTWARE T-CON'!$C$11)","v":"Tecnico:  Ufficio Tecnico"},null,null,null,null,null,{"$f":"Analisi!E196","v":"Versione 2.8.2"},null,null,null,null,null,null,"Pagina 3/3"]

{"sheet":"Verifica Armatura","index":3,"n_rows":217,"n_cols":13,"rows_kept":217,"cut":false,"hidden":false,"merged":[[142,0,142,2],[142,6,142,7],[142,12,142,13],[216,0,216,2],[216,6,216,7],[216,12,216,13],[77,10,77,12],[6,0,7,13],[9,3,9,6],[9,12,9,13],[92,10,92,12],[69,0,69,2],[69,6,69,7],[69,12,69,13],[36,10,36,12],[43,10,43,12],[64,10,64,12],[57,10,57,12],[65,0,68,13]]}
[]
[]
[]
[]
[]
[]
["RELAZIONE DI CALCOLO : VERIFICA ARMATURE DI RIPARTIZIONE NELLA SOLETTA IN CLS E ARMATURA DEL CORDOLO                 SOLAI MISTI LEGNO-CLS CON CONNETTORI \"T-CON\""]
[]
["Cantiere:",null,null,{"$f":"Analisi!B9","v":0},null,null,null,null,null,null,null,"Data:",{"$f":"TODAY()","v":"2018-12-21"}]
["Posizione solaio:",null,null,{"$f":"Analisi!J9","v":"C1"},null,null,null,null,null,null,null,"ID interno:"]
[]
["1 Riepilogo valori impiegati:"]
[]
["Spessore della soletta:",null,null,null,null,null,null,null,null,null,"h1 =",{"$f":"Analisi!E21","v":60},"mm"]
["Interassi travi in legno:",null,null,null,null,null,null,null,null,null,"i = b1 =",{"$f":"Analisi!L13","v":650},"mm"]
["Interasse collaborante:",null,null,null,null,null,null,null,null,null,"ic =",{"$f":"'SOFTWARE T-CON'!E25","v":650},"mm"]
["Coefficiente di resistenza differita del legno:",null,null,null,null,null,null,null,null,null,"kmod =",{"$f":"Analisi!$L$40","v":0.8},"-"]
["Resistenza caratteristica acciaio B450C:",null,null,null,null,null,null,null,null,null,"fy,k",450,"N/mm2"]
["Resistenza caratteristica a compressione cilindrica cls:",null,null,null,null,null,null,null,null,null,"fc,k =",{"$f":"Analisi!E58","v":25},"N/mm2"]
["Resistenza caratteristica a trazione cls:",null,null,null,null,null,null,null,null,null,"ft,k =",{"$f":"Analisi!E59","v":1.7954747440105308},"N/mm2"]
["Coefficiente di sicurezza cls:",null,null,null,null,null,null,null,null,null,"gM,cls =",{"$f":"Analisi!$L$60","v":1.5},"-"]
["Coefficiente di sicurezza acciaio:",null,null,null,null,null,null,null,null,null,"gM,S =",{"$f":"Analisi!$L$65","v":1.1499999999999999},"-"]
[]
["2 Armatura Longitudinale - Rete elettrosaldata intradosso soletta di cls - t=0:"]
[]
["Tensione massima per flessione intradosso soletta/estradosso isolante:",null,null,null,null,null,null,null,null,null,"sm,1 - sol/iso =",{"$f":"Analisi!E140","v":3.8902413873016215},"N/mm2"]
["Tensione massima di trazione intradosso soletta/estradosso isolante:",null,null,null,null,null,null,null,null,null,"s1 - sol/iso =",{"$f":"Analisi!E141","v":2.7306141477553831},"N/mm2"]
["Asse neutro tensioni nel cls:",null,null,null,null,null,null,null,null,null,"x = yG,CLS =",{"$f":"Analisi!E142","v":30},"mm"]
["Altezza isolante:",null,null,null,null,null,null,null,null,null,"hisolante =",{"$f":"Analisi!E143","v":0},"mm"]
["Altezza cls teso in soletta:",null,null,null,null,null,null,null,null,null,"x - hisolante =",{"$f":"Analisi!E144","v":30},"mm"]
["Trazione massima assorbita dalla rete elettrosaldata:",null,null,null,null,null,null,null,null,null,"Ft,l =",{"$f":"Analisi!E145","v":26623.487940614985},"N"]
["Area minima di acciaio:",null,null,null,null,null,null,null,null,null,"Amin =",{"$f":"Analisi!L140","v":68.037802514904953},"mm2"]
["Maglia della rete elettrosaldata - Passo tondi:",null,null,null,null,null,null,null,null,null,"P.T. =",{"$f":"Analisi!L141","v":200},"mm"]
["Numero tondi nell'interasse collaborante della rete elettrosaldata:",null,null,null,null,null,null,null,null,null,"Nt =",{"$f":"Analisi!L142","v":3.25},"-"]
["Area di una barra della rete elettrosaldata:",null,null,null,null,null,null,null,null,null,"As,d = ",{"$f":"Analisi!L143","v":28.274333882308138},"mm2"]
["Rete disposta:",null,null,null,null,null,null,null,null,null,"As,d = ",{"$f":"Analisi!L144","v":91.89158511750145},"mm2"]
[null,null,null,null,null,null,null,null,null,null,{"$f":"IF(L31<=0,\"ARMATURA NON NECESSARIA\",IF(L36>=L32,\"VERIFICATO\",\"ARMATURA NON SUFFICIENTE\"))","v":"VERIFICATO"}]
["3 Armatura Longitudinale - Armatura cordolo intradosso cls nel caso di isolante - t=0:"]
[]
["Tensione massima di trazione intradosso soletta/estradosso isolante:",null,null,null,null,null,null,null,null,null,"s1,T =",{"$f":"IF(L29=0,\"-\",Analisi!E147)","v":"-"},"N/mm2"]
["Larghezza cordolo in calcestruzzo:",null,null,null,null,null,null,null,null,null,"Biso =",{"$f":"IF(L29=0,\"-\",Analisi!E148)","v":"-"},"N/mm2"]
["Area minima di acciaio:",null,null,null,null,null,null,null,null,null,"Amin,l =",{"$f":"IF(L29=0,\"-\",Analisi!L147)","v":"-"},"mm"]
["Area di progetto impiegata:",null,null,null,null,null,null,null,null,null,"As,c,d =",{"$f":"Analisi!L148","v":0},"mm"]
[null,null,null,null,null,null,null,null,null,null,{"$f":"Analisi!K149","v":"ARMATURA NON NECESSARIA"}]
["4 Armatura Longitudinale - Rete elettrosaldata intradosso soletta di cls - t=¥:"]
[]
["Tensione massima per flessione intradosso soletta/estradosso isolante:",null,null,null,null,null,null,null,null,null,"sm,1 - sol/iso =",{"$f":"Analisi!E151","v":2.2032534925197318},"N/mm2"]
["Tensione massima di trazione intradosso soletta/estradosso isolante:",null,null,null,null,null,null,null,null,null,"s1 - sol/iso =",{"$f":"Analisi!E152","v":1.0260154667937607},"N/mm2"]
["Asse neutro tensioni nel cls:",null,null,null,null,null,null,null,null,null,"x = yG,CLS =",{"$f":"Analisi!E153","v":30},"mm"]
["Altezza isolante:",null,null,null,null,null,null,null,null,null,"hisolante =",{"$f":"Analisi!E154","v":0},"mm"]
["Altezza cls teso in soletta:",null,null,null,null,null,null,null,null,null,"x - hisolante =",{"$f":"Analisi!E155","v":30},"mm"]
["Trazione massima assorbita dalla rete elettrosaldata:",null,null,null,null,null,null,null,null,null,"Ft,l =",{"$f":"Analisi!E156","v":10003.650801239166},"N"]
["Area minima di acciaio:",null,null,null,null,null,null,null,null,null,"Amin =",{"$f":"Analisi!L151","v":25.564885380944531},"mm2"]
["Maglia della rete elettrosaldata - Passo tondi:",null,null,null,null,null,null,null,null,null,"P.T. =",{"$f":"Analisi!L152","v":200},"mm"]
["Numero tondi nell'interasse collaborante della rete elettrosaldata:",null,null,null,null,null,null,null,null,null,"Nt =",{"$f":"Analisi!L153","v":3.25},"-"]
["Area di una barra della rete elettrosaldata:",null,null,null,null,null,null,null,null,null,"As,d = ",{"$f":"Analisi!L154","v":28.274333882308138},"mm2"]
["Rete disposta:",null,null,null,null,null,null,null,null,null,"As,d = ",{"$f":"Analisi!L155","v":91.89158511750145},"mm2"]
[null,null,null,null,null,null,null,null,null,null,{"$f":"IF(L52<=0,\"ARMATURA NON NECESSARIA\",IF(L57>=L53,\"VERIFICATO\",\"ARMATURA NON SUFFICIENTE\"))","v":"VERIFICATO"}]
["5 Armatura Longitudinale - Armatura cordolo intradosso cls nel caso di isolante - t=¥:"]
[]
["Tensione massima di trazione intradosso soletta/estradosso isolante:",null,null,null,null,null,null,null,null,null,"s1,T =",{"$f":"IF(L50=0,\"-\",Analisi!E158)","v":"-"},"N/mm2"]
["Larghezza cordolo in calcestruzzo:",null,null,null,null,null,null,null,null,null,"Biso =",{"$f":"IF(L50=0,\"-\",Analisi!E159)","v":"-"},"N/mm2"]
["Area minima di acciaio:",null,null,null,null,null,null,null,null,null,"Amin,l =",{"$f":"IF(L50=0,\"-\",Analisi!L158)","v":"-"},"mm"]
["Area di progetto impiegata:",null,null,null,null,null,null,null,null,null,"As,c,d =",{"$f":"Analisi!L159","v":0},"mm"]
[null,null,null,null,null,null,null,null,null,null,{"$f":"Analisi!K160","v":"ARMATURA NON NECESSARIA"}]
["NOTE: E' buona norma eseguire anche un controllo sulla armatura trasversale, nonché un controllo sulla resistenza a scorrimento della soletta. I calcoli qui riportati dovranno essere IN OGNI CASO controllati e approvati dal Vostro tecnico responsabile delle strutture. La presente relazione di calcolo non costituisce documento esecutivo, è redatta al solo fine indicativo sulla base di dati forniti. La presente dovrà essere sempre conformata dal Vs. tecnico responsabile delle strutture o da tecnico abilitato. La società Roofrox Srl declina ogni responsabilità per utilizzi impropri del presente software di calcolo. Il presente foglio non può essere modificato e/o distributo in alcun modo senza il consenso scritto di RoofRox Srl."]
[]
[]
[]
[{"$f":"CONCATENATE('SOFTWARE T-CON'!$A11,'SOFTWARE T-CON'!$Y17,'SOFTWARE T-CON'!$C11)","v":"Tecnico:  Ufficio Tecnico"},null,null,null,null,null,{"$f":"Analisi!E196","v":"Versione 2.8.2"},null,null,null,null,null,"Pagina 1/1"]
[]
[]
[]
["2 Armatura Trasversale - Rispetto minimo EC4 - par. 6.6.4.1:"]
[]
["Armatura trasversale in soletta:",null,null,null,null,null,null,null,null,null,"As > 0,002·ssoletta·(1000 mm) = ",{"$f":"2/1000*L14*1000","v":120},"mm2/m"]
["Rete disposta:",null,null,null,null,null,null,null,"Æ",{"$f":"CONCATENATE(VLOOKUP('Caratteristiche Materiali'!O48,'Caratteristiche Materiali'!O42:R47,2),\"            \",\"As=\")","v":"6 mm/20x20            As="},null,{"$f":"VLOOKUP('Caratteristiche Materiali'!O48,'Caratteristiche Materiali'!O42:R47,4)","v":141.37166941154069},"mm2/m"]
[null,null,null,null,null,null,null,null,null,null,{"$f":"IF(L76<=L77,\"VERIFICATO\",\"NON VERIFICATO\")","v":"VERIFICATO"}]
[]
[]
["3 Armatura Trasversale - Resistenza a scorrimento cls EC4 - par. 6.6.2"]
[]
["Superficie di scorrimento soletta ",null,null,null,null,null,null,null,null,null,"Acv = 2·s·1000mm =",{"$f":"2*L14*1000","v":120000},"mm2"]
["Resistenza a scorrimento del calcestruzzo:",null,null,null,null,null,null,null,null,null,"tRd = 0,25·fctk 0,05/gc = ",{"$f":"0.25*L20/L21","v":0.29924579066842177},"N/mm2"]
["Coefficiente impiegato nel calcolo per cls del tipo \"non alleggerito\":",null,null,null,null,null,null,null,null,null,"h=",1,"-"]
["Area barre di armatura che attraversano la superficie di scorrimento:",null,null,null,null,null,null,null,null,null,"Ae = 2·As =",{"$f":"2*L77","v":282.74333882308139},"mm2"]
["Resistenza convenzionale delle bielle di calcestruzzo:",null,null,null,null,null,null,null,null,null,"VRd2 = 0,2·Acv·h·fck/gc = ",{"$f":"0.2*L83*L85*L19/L21","v":400000},"N/m"]
["Resistenza della sezione longitudinale con armatura a taglio:",null,null,null,null,null,null,null,null,null,"VRd3 = 2,5·Acv·h·tRd + Ae·fyk/gs = ",{"$f":"(2.5*L83*L85*L84)+(L86*L18/L22)","v":200412.43500086275},"N/m"]
["Resistenza assunta",null,null,null,null,null,null,null,null,null,"VRd = min[VRd2;VRd3] = ",{"$f":"MIN(L87:L88)","v":200412.43500086275},"N/m"]
["Interasse minimo connettori:",null,null,null,null,null,null,null,null,null,"smin = ",{"$f":"Analisi!E47","v":130},"mm"]
[{"$f":"IF(Analisi!E46=1,\"Numero di connettori nel primo metro dagli appoggi:\",IF(Analisi!E46=2,\"Numero di coppie di connettori nel primo metro dagli appoggi:\",\"Numero di terne di connettori nel primo metro dagli appoggi:\"))","v":"Numero di connettori nel primo metro dagli appoggi:"},null,null,null,null,null,null,null,null,null,"Nc =1metro/smin =",{"$f":"1000/L90","v":7.6923076923076925},"-"]
["Scorrimento massimo nella soletta trasferito dai connettori (nel primo metro dagli appoggi):",null,null,null,null,null,null,null,null,null,"VSd,max = Fconn/smin =",{"$f":"(MAX(Analisi!E107,Analisi!E120))*L91*1000","v":37613.749516282944},"N/m"]
[null,null,null,null,null,null,null,null,null,null,{"$f":"IF(L92<=L89,\"VERIFICATO\",\"NON VERIFICATO\")","v":"VERIFICATO"}]
[]
[]
[]
[]
[]
[]
[]
[]
[]
[]
[]
[]
[]
[]
[]
[]
[]
[]
[]
[]
[]
[]
[]
[]
[]
[]
[]
[]
[]
[]
[]
[]
[]
[]
[]
[]
[]
[]
[]
[]
[]
[]
[]
[]
[]
[]
[]
[]
[]
[{"$f":"CONCATENATE('SOFTWARE T-CON'!$A$11,'SOFTWARE T-CON'!$Y$17,'SOFTWARE T-CON'!$C$11)","v":"Tecnico:  Ufficio Tecnico"},null,null,null,null,null,"Versione 1.0.7",null,null,null,null,null,"Pagina 2/3"]
[]
[]
[]
[]
[]
[]
[]
[]
[]
[]
[]
[]
[]
[]
[]
[]
[]
[]
[]
[]
[]
[]
[]
[]
[]
[]
[]
[]
[]
[]
[]
[]
[]
[]
[]
[]
[]
[]
[]
[]
[]
[]
[]
[]
[]
[]
[]
[]
[]
[]
[]
[]
[]
[]
[]
[]
[]
[]
[]
[]
[]
[]
[]
[]
[]
[]
[]
[]
[]
[]
[]
[]
[]
[{"$f":"CONCATENATE('SOFTWARE T-CON'!$A$11,'SOFTWARE T-CON'!$Y$17,'SOFTWARE T-CON'!$C$11)","v":"Tecnico:  Ufficio Tecnico"},null,null,null,null,null,"Versione 1.0.7",null,null,null,null,null,"Pagina 3/3"]

{"sheet":"Note","index":4,"n_rows":50,"n_cols":9,"rows_kept":50,"cut":false,"hidden":false,"merged":[]}
[]
[]
[null,"DATI RIPORTATI NEL TESTO: \"Strutture in Legno\" - Materiale, calcolo e preogetto secondo le nuove normative europee - "]
[null,"Maurizio Piazza; Roberto Tomasi; Roberto Modena - Editore: HOEPLI"]
[]
[]
[null,"CARICHI DI DURATA PERMANENTE",null,null,null,"pesi propri e carichi non rimovibili (durante la vita della struttura)"]
[]
[null,"CARICHI DI LUNGA DURATA",null,null,null,"carichi permanenti suscettibili di cambiamenti (durante il normale esercizio della struttura)"]
[null,null,null,null,null,"sovraccarichi variabili relativi a magazzini e depositi."]
[]
[null,"CARICHI DI MEDIA DURATA",null,null,null,"i sovraccarichi variabili (esercizio sui solai e neve sulle coperture)"]
[]
[null,"CARICHI DI DURATA ISTANTANEA",null,null,null,"azioni del vento e le azioni eccezionali"]
[]
[]
[]
[null,"Classi di durata del carico",null,null,null,"Durata del carico caratteristico"]
[]
[null,"Permanente",null,null,null,"più di 10 anni"]
[null,"Lunga durata",null,null,null,"da 6 mesi a 10 anni"]
[null,"Media durata",null,null,null,"da 1 settimana a 6 mesi"]
[null,"Breve durata",null,null,null,"meno di 1 settimana"]
[null,"Istantaneo",null,null,null," -"]
[]
[]
[null,"CLASSE DI SERVIZIO 1",null,null,"è caratterizzata da un'umidità del materiale in equilibrio con ambiente a una temperatura di 20° C e un'umidità relativa dell'aria circostante che superi"]
[null,null,null,null,"il 65% se non per poche settimane all'anno. Possono appartenenere a tale classe gli elementi lignei protetti contro le intemperie come quelli posti "]
[null,null,null,null,"all'interno degli edifici in ambienti condizionati. "]
[]
[null,"CLASSE DI SERVIZIO 2",null,null,"è caratterizzata da un'umidità dei materiali in equilibrio con ambiente a una temperatura di 20° C e un'umidità relativa dell'aria circostante che superi l'85%"]
[null,null,null,null,"solo per poche settimane all'anno. Possono appartenere a tale classe gli elementi lignei posti all'esterno degli edifici ma protetti, almeno parzialmente, dalle"]
[null,null,null,null,"intemperie e dall'irraggiamento solare diretto."]
[]
[null,"CLASSE DI SERVIZIO 3",null,null,"condizioni climatiche che prevedono umidità più elevate di quelle della classe di servizio 2. Possono appartenere a tale classe gli elementi lignei posti"]
[null,null,null,null,"all'esterno degli edifici direttamente esposti alle intemperie."]
[]
[]
[]
[null,"Valore dei carichi di esercizio per le diverse categorie di edifici"]
[]
[null,"Azione",null,null,null,"Q","y0,j ","y1,j ","y2,j "]
[null,"Cat. A: Amb. ad uso residenziale",null,null,null,2,0.7,0.5,0.3]
[null,"Cat. B: Uffici",null,null,null,2,0.7,0.5,0.3]
[null,"Cat. C: Amb. suscettibili di affollamento",null,null,null,4,0.7,0.7,0.6]
[null,"Cat. D: Amb. ad uso commerciale",null,null,null,5,0.7,0.7,0.6]
[null,"Cat. E: Biblioteche, archivi, ...",null,null,null,6,1,0.9,0.8]
[null,"Cat. H: Coperture",null,null,null,0.5,0,0,0]
[null,"Neve (a quota < 1000 m)",null,null,null,"da valutare",0.5,0.2,0]
[null,"Neve (a quota > 1000 m)",null,null,null,"da valutare",0.7,0.5,0.2]

{"sheet":"Caratteristiche Materiali","index":5,"n_rows":81,"n_cols":24,"rows_kept":81,"cut":false,"hidden":true,"merged":[]}
[]
[null,null,"Resistenze legno lamellare di conifera omogeneo e combinato (EN 1194: 1999)",null,null,null,null,null,null,null,null,null,null,null,null,null,null,null,null,null,null,null,"Barre d'armatura"]
[null,null,null,"[N/mmq]","[N/mmq]","[N/mmq]","[N/mmq]","[N/mmq]","[N/mmq]","[N/mmq]","[N/mmq]","[N/mmq]","[N/mmq]","[kg/mc]","[kg/mc]"]
[null,"CONT",null,"fm,g,k","ft,0,g,k","ft,90,g,k","fc,0,g,k","fc,90,g,k","fv,g,k","E0,g,mean","E0,g,05","E90,g,mean","Gg,mean","rg,k","rm",null,null,null,null,null,null,"CONT","fi","A"]
[null,1,"GL20h",20,16,0.5,20,2.5,3.5,8400,7000,300,650,340,370,null,null,null,null,null,null,1,10,{"$f":"PI()*W5^2/4","v":78.539816339744831}]
[null,{"$f":"B5+1","v":2},"GL20c",20,15,0.5,18.5,2.5,3.5,10400,8600,300,250,355,390,null,null,null,null,null,null,2,12,{"$f":"PI()*W6^2/4","v":113.09733552923255}]
[null,{"$f":"B6+1","v":3},"GL22h",22,17.600000000000001,0.5,22,2.5,3.5,10500,8800,300,650,370,410,"uni en 14080:2013",null,null,null,null,null,3,14,{"$f":"PI()*W7^2/4","v":153.93804002589985}]
[null,4,"GL22c",22,16,0.5,20,2.5,3.5,10400,8600,300,650,355,390,"uni en 14080:2013",null,null,null,null,null,4,16,{"$f":"PI()*W8^2/4","v":201.06192982974676}]
[null,5,"GL24h",24,19.2,0.5,24,2.5,3.5,11500,9600,300,650,385,420,"uni en 14080:2013",null,null,null,null,null,2]
[null,6,"GL24c",24,17,0.5,21.5,2.5,3.5,11000,9100,300,650,365,400,"uni en 14080:2013"]
[null,7,"GL26h",26,20.8,0.5,26,2.5,3.5,12100,10100,300,650,405,445,"uni en 14080:2013",null,null,null,null,null,"CONT","numeri"]
[null,8,"GL26c",26,19,0.5,23.5,2.5,3.5,12000,10000,300,650,385,420,"uni en 14080:2013",null,null,null,null,null,1,0]
[null,9,"GL28h",28,22.3,0.5,28,2.5,3.5,{"$f":"12.6*1000","v":12600},10500,300,650,425,460,"uni en 14080:2013",null,null,null,null,null,2,1]
[null,10,"GL28c",28,19.5,0.5,24,2.5,3.5,12500,10400,300,650,390,420,"uni en 14080:2013",null,null,null,null,null,3,2]
[null,11,"GL30h",30,24,0.5,30,2.5,3.5,13600,11300,300,650,430,480,"uni en 14080:2013",null,null,null,null,null,1]
[null,12,"GL30c",30,19.5,0.5,24.5,2.5,3.5,13000,10800,300,650,390,430,"uni en 14080:2013"]
[null,13,"GL32h",32,25.6,0.5,32,2.5,3.5,14200,11800,300,650,440,490,"uni en 14080:2013"]
[null,14,"GL32c",32,19.5,0.5,24.5,2.5,3.5,13700,11200,300,650,400,440,"uni en 14080:2013"]
[null,15,"C14",14,8,0.4,16,2,1.7,{"$f":"7*1000","v":7000},{"$f":"4.7*1000","v":4700},{"$f":"0.23*1000","v":230},{"$f":"0.44*1000","v":440},290,350,"prEN 338: 2002"]
[null,16,"C16",16,10,0.5,17,2.2000000000000002,1.8,{"$f":"8*1000","v":8000},{"$f":"5.4*1000","v":5400},{"$f":"0.27*1000","v":270},{"$f":"0.5*1000","v":500},310,370,"prEN 338: 2002"]
[null,17,"C18",18,11,0.5,18,2.2000000000000002,2,{"$f":"9*1000","v":9000},{"$f":"6*1000","v":6000},{"$f":"0.3*1000","v":300},{"$f":"0.56*1000","v":560},320,380,"prEN 338: 2002"]
[null,18,"C20",20,12,0.5,19,2.2999999999999998,2.2000000000000002,{"$f":"9.5*1000","v":9500},{"$f":"6.4*1000","v":6400},{"$f":"0.32*1000","v":320},{"$f":"0.59*1000","v":590},330,390,"prEN 338: 2002"]
[null,19,"C22",22,13,0.5,20,2.4,2.4,{"$f":"10*1000","v":10000},{"$f":"6.7*1000","v":6700},{"$f":"0.33*1000","v":330},{"$f":"0.63*1000","v":630},340,410,"prEN 338: 2002"]
[null,20,"C24",24,14,0.5,21,2.5,2.5,{"$f":"11*1000","v":11000},{"$f":"7.4*1000","v":7400},{"$f":"0.37*1000","v":370},{"$f":"0.69*1000","v":690},350,420,"prEN 338: 2002"]
[null,21,"C27",27,16,0.6,22,2.6,2.8,{"$f":"11.5*1000","v":11500},{"$f":"7.7*1000","v":7700},{"$f":"0.38*1000","v":380},{"$f":"0.72*1000","v":720},370,450,"prEN 338: 2002"]
[null,22,"C30",30,18,0.6,23,2.7,3,{"$f":"12*1000","v":12000},{"$f":"8*1000","v":8000},{"$f":"0.4*1000","v":400},{"$f":"0.75*1000","v":750},380,460,"prEN 338: 2002"]
[null,23,"C35",35,21,0.6,25,2.8,3.4,{"$f":"13*1000","v":13000},{"$f":"8.7*1000","v":8700},{"$f":"0.43*1000","v":430},{"$f":"0.81*1000","v":810},400,480,"prEN 338: 2002"]
[null,24,"C40",40,24,0.6,26,2.9,3.8,{"$f":"14*1000","v":14000},{"$f":"9.4*1000","v":9400},{"$f":"0.47*1000","v":470},{"$f":"0.88*1000","v":880},420,500,"prEN 338: 2002"]
[null,25,"C45",45,27,0.6,27,3.1,3.8,{"$f":"15*1000","v":15000},{"$f":"10*1000","v":10000},{"$f":"0.5*1000","v":500},{"$f":"0.94*1000","v":940},440,520,"prEN 338: 2002"]
[null,26,"C50",50,30,0.6,29,3.2,3.8,{"$f":"16*1000","v":16000},{"$f":"10.7*1000","v":10700},{"$f":"0.53*1000","v":530},{"$f":"1*1000","v":1000},460,550,"prEN 338: 2002"]
[null,27,"D24",24,14,0.6,21,7.8,4,10000,8500,{"$f":"0.67*1000","v":670},{"$f":"0.62*1000","v":620},485,580]
[null,28,"D30",30,18,0.6,23,8,4,11000,9200,730,690,530,"-"]
[null,5,null,"[N/mmq]","[N/mmq]","[N/mmq]","[N/mmq]","[N/mmq]","[N/mmq]","[N/mmq]","[N/mmq]","[N/mmq]","[N/mmq]","[kg/mc]","[kg/mc]"]
[null,null,null,"fm,g,k","ft,0,g,k","ft,90,g,k","fc,0,g,k","fc,90,g,k","fv,g,k","E0,g,mean","E0,g,05","E90,g,mean","Gg,mean","rg,k","rm"]
[null,null,"Resistenze legno di confiere e di pioppo (prEN 338: 2002)"]
[]
[]
[]
[]
[null,null,null,"[N/mmq]","[N/mmq]","[N/mmq]","[N/mmq]","[kN/mc]","[-]","[-]","[-]"]
[null,"CONT",null,"fc,k","Rc,k","ft,k","Ecls",null,"h1","h2","hE",null,null,null,"CONT",null,"rete","mm2/m","Passo tondi","Area tondo"]
[null,1,"C20/25",20,25,{"$f":"0.7*(0.3*D42^(2/3))","v":1.5472932294289619},{"$f":"22*(0.083*E42+0.8)^0.3*1000","v":30200.493207846379},25,"-","-","-",null,null,null,1,"6 mm/10x10","Æ6/10x10",{"$f":"((100/10)*PI()*(0.6^2)/4)*100","v":282.74333882308139},100,{"$f":"PI()*6^2/4","v":28.274333882308138}]
[null,{"$f":"B42+1","v":2},"C25/30",25,30,1.7954747440105308,31447.161439943484,25,"-","-","-",null,null,null,2,"6 mm/15x15","Æ6/15x15",{"$f":"((100/15)*PI()*(0.6^2)/4)*100","v":188.49555921538757},150,{"$f":"T42","v":28.274333882308138}]
[null,{"$f":"B43+1","v":3},"C28/35",28,35,1.9363832426645466,32588.107818695284,25,"-","-","-",null,null,null,3,"6 mm/20x20","Æ6/20x20",{"$f":"(100/20)*PI()*(0.6^2)/4*100","v":141.37166941154069},200,{"$f":"T43","v":28.274333882308138}]
[null,4,"C30/37",30,37,2.0275277076718221,33019.434581752503,25,"-","-","-",null,null,null,4,"8 mm/10x10","Æ8/10x10",{"$f":"(100/10)*PI()*(0.8^2)/4*100","v":502.65482457436701},100,{"$f":"PI()*8^2/4","v":50.26548245743669}]
[null,5,"C32/40",32,40,2.1166673638233866,33642.777677364676,25,"-","-","-",null,null,null,5,"8 mm/15x15","Æ8/15x15",{"$f":"(100/15)*PI()*(0.8^2)/4*100","v":335.10321638291134},150,{"$f":"T45","v":50.26548245743669}]
[null,6,"C35/40",35,40,2.2469737091866655,33642.777677364676,25,"-","-","-",null,null,null,6,"8 mm/20x20","Æ8/20x20",{"$f":"(100/20)*PI()*(0.8^2)/4*100","v":251.32741228718351},200,{"$f":"T46","v":50.26548245743669}]
[null,7,"LC25/28",25,28,{"$f":"0.7*(I48*0.3*D48^(2/3))","v":1.4894279126450993},{"$f":"22000*(D48/10)^0.3*K48","v":14842.957298302812},15.75,{"$f":"0.4+0.6*H48*100/2200","v":0.82954545454545459},1,{"$f":"(H48*100/2200)^2","v":0.51252582644628109},null,null,null,3]
[null,8,"Leca CLS 1400 - LC 20/22",20,22,{"$f":"0.7*(I49*0.3*D49^(2/3))","v":1.2730003387574642},15000,15.5,{"$f":"0.4+0.6*H49*100/2200","v":0.82272727272727275},1,{"$f":"(H49*100/2200)^2","v":0.49638429752066121}]
[null,9,"Leca CLS 1600 - LC 31.5/35",31.5,35,{"$f":"0.7*(I50*0.3*D50^(2/3))","v":1.837501174905334},20000,17.5,{"$f":"0.4+0.6*H50*100/2200","v":0.87727272727272732},1,{"$f":"(H50*100/2200)^2","v":0.63274793388429751}]
[null,10,"Leca CLS 1800 - LC 40.5/45",40.5,45,{"$f":"0.7*(I51*0.3*D51^(2/3))","v":2.3077414845141737},25000,19.5,{"$f":"0.4+0.6*H51*100/2200","v":0.93181818181818188},1,{"$f":"(H51*100/2200)^2","v":0.78564049586776863}]
[null,2]
[]
[]
[]
[null,null,null,"mm","mm","mm","N/mm","mm","mm","mm","mm","mm","mm","mm","mm","mm","Nmm","mm","N/mm2","kN"]
[null,"CONT",null,"fi","Ltot","Lfilettata","Kser","Lsp","toll","P","toll","di","toll","Lm","def","Lef","Myk","ds","fax,k,90","ftens,k"]
[null,1,"T-CON 8.0x155",8,158.85,100,7700,8.1999999999999993,2.1,5.6,0.56000000000000005,5.3,0.26,{"$f":"SUM($H$58:$K$58)","v":16.459999999999997},{"$f":"1.1*$L$58","v":5.83},100,22600,5.9,10.7,22.7]
[null,2,"T-CON 8.0x205",8,208.85,130,9000,8.1999999999999993,2.1,5.6,0.56000000000000005,5.3,0.26,{"$f":"SUM($H$58:$K$58)","v":16.459999999999997},{"$f":"1.1*$L$58","v":5.83},100,22600,5.9,10.7,22.7]
[null,2]
[]
[null,null,"Densità legname per il tavolato"]
[null,null,null,"[kg/mc]","[kg/mc]","[mm]"]
[null,"CONT",null,"rg,k","rm","sp"]
[null,1,"Legno di Conifera C16",550]
[null,{"$f":"B65+1","v":2},"Legno di Conifera C24",550]
[null,{"$f":"B66+1","v":3},"Legno di Latifoglia D35",550]
[null,4,"Legno di Latifoglia D30",550]
[null,5,"Legno di Latifoglia D24",550]
[null,6,"Pannello OSB",550]
[null,7,"Pannello fibrogesso A1 - sp. 10 mm",1150,null,10]
[null,8,"Pannello fibrogesso A1 - sp. 12,5 mm",1200,null,12.5]
[null,9,"Pannello fibrogesso A1 - sp. 15 mm",1200,null,15]
[null,10,"Pannello fibrogesso A1 - sp. 18 mm",1166.6666666000001,null,18]
[null,11,"Tavella in laterizio sp. 3,5 cm",null,null,35]
[null,12,"Tavella in laterizio sp. 5 cm",null,null,50]
[null,13,"Pianella in laterizio sp. 4,0 cm",1800,null,40]
[null,14,"Pianella in laterizio sp. 3,0 cm",1800,null,30]
[null,15,"Pianella in laterizio sp. 2,6 cm",1800,null,26]
[null,16,"Pianella in laterizio sp. 1,6 cm",1800,null,16]
[null,2]

{"sheet":"Prescrizioni","index":6,"n_rows":187,"n_cols":14,"rows_kept":187,"cut":false,"hidden":true,"merged":[]}
[null,"Normative di riferimento"]
[null,"CONT",null,"Lamellare","Massiccio","Unioni"]
[null,1,"D.M. 17.01.2018 - Colonna \"A\"",1.45,1.5,1.5]
[null,2,"D.M. 17.01.2018 - Colonna \"B\"",1.35,1.45,1.4]
[null,3,"D.M. 14.01.2008",1.45,1.5,1.5]
[null,4,"UNI EN 1995-1-1:2014",1.25,1.3,1.3]
[null,1]
[]
[]
[null,"LIMITI PER SOLAI DI COPERTURA",null,null,null,null,"(riferiti per luce L in pianta)"]
[null,"limite freccia istantanea sui (soli) carichi variabili",null,null,null,null,"qk:","u2,ist < L / ",300]
[null,"limite freccia finale sui (soli) carichi variabili",null,null,null,null,"qk:","u2,fin < L / ",200]
[null,"limite freccia netta (finale) su tutti i carichi:",null,null,null,null,"gk e qk:","unet,fin < L / ",200]
[]
[]
[null,"LIMITI PER SOLAI di interpiano (consigliati)",null,null,null,null,"(riferiti per luce L in pianta)"]
[null,"limite freccia istantanea sui (soli) carichi variabili",null,null,null,null,"qk:","u2,ist < L /",400]
[null,"limite freccia finale sui (soli) carichi variabili",null,null,null,null,"qk:","u2,fin < L /",500]
[null,"limite freccia netta (finale) su tutti i carichi:",null,null,null,null,"gk e qk:","unet,fin < L /",500]
[]
[]
[]
[null,"CONT","Azione","Q","y0,j ","y1,j ","y2,j "]
[null,1,"Cat. A: Amb. ad uso residenziale",2,0.7,0.5,0.3]
[null,2,"Cat. B: Uffici",2,0.7,0.5,0.3]
[null,3,"Cat. C: Amb. suscettibili di affollamento",4,0.7,0.7,0.6]
[null,4,"Cat. D: Amb. ad uso commerciale",5,0.7,0.7,0.6]
[null,5,"Cat. E: Biblioteche, archivi, ...",6,1,0.9,0.8]
[null,6,"Neve (a quota < 1000 m)",1.2,0.5,0.2,0]
[null,7,"Neve (a quota > 1000 m)",1.2,0.7,0.5,0.2]
[null,8,"Coperture",0.5,0,0,0]
[null,1]
[]
[]
[]
[null,"Valori di \"kdef\" per i prodotti strutturali a base di legno (EN 1995-1-1/D.M.14.01.2008)"]
[]
[]
[null,"Materiale ","rif.","CONT","Classe servizio","kdef"]
[null,"LM","EN 14081-1",1,1,0.6]
[null,"LL",null,2,2,0.8]
[null,null,null,3,3,2]
[null,null,"valore attuale",1," <-- classe serv."]
[]
[]
[null,"Valori di \"kmod\" per i prodotti strutturali a base di legno (EN 1995-1-1/D.M.14.01.2008)"]
[]
[null,"Materiale ","rif.","CONT","Classe servizio","permanente","Lunga","Media","Breve","Istantaneo"]
[null,"LM","EN 14081-1",1,1,0.6,0.7,0.8,0.9,1.1000000000000001]
[null,"LL",null,2,2,0.6,0.7,0.8,0.9,1.1000000000000001]
[null,null,null,3,3,0.5,0.55000000000000004,0.65,0.7,0.9]
[null,null,"valore attuale",{"$f":"D43","v":1}," <-- classe serv."]
[]
[null,null,null,"CONT"]
[null,null,null,1,"Permanente",{"$f":"VLOOKUP($D$52,$D$49:$J$51,3)","v":0.6}]
[null,null,null,2,"Lunga",{"$f":"VLOOKUP($D$52,$D$49:$J$51,4)","v":0.7}]
[null,null,null,3,"Media",{"$f":"VLOOKUP($D$52,$D$49:$J$51,5)","v":0.8}]
[null,null,null,4,"Breve",{"$f":"VLOOKUP($D$52,$D$49:$J$51,6)","v":0.9}]
[null,null,null,5,"Istantaneo",{"$f":"VLOOKUP($D$52,$D$49:$J$51,7)","v":1.1000000000000001}]
[null,null,null,3]
[]
[]
[null,null,"ANGOLI",null,null,"AMMORSAMENTO",null,null,null,"Valore minimo passo minimo",null,null,100,"mm"]
[null,"CONT",null,null,"CONT"]
[null,1,45,null,1,0]
[null,2,90,null,2,{"$f":"F65+1","v":1}]
[null,1,null,null,{"$f":"E66+1","v":3},{"$f":"F66+1","v":2}]
[null,null,null,null,{"$f":"E67+1","v":4},3]
[null,null,null,null,5,4]
[null,null,null,null,6,5]
[null,null,null,null,7,6]
[null,null,null,null,8,7]
[null,null,null,null,9,8]
[null,null,null,null,10,9]
[null,null,null,null,11,10]
[null,null,null,null,12,{"$f":"IF(B67=2,\"-\",11)","v":11}]
[null,null,null,null,13,{"$f":"IF(B67=2,\"-\",12)","v":12}]
[null,null,null,null,14,{"$f":"IF(B67=2,\"-\",13)","v":13}]
[null,null,null,null,15,{"$f":"IF(B67=2,\"-\",14)","v":14}]
[null,null,null,null,15]
[]
[]
[null,"Valori di pendenza, angoli e moltiplicatori di falda"]
[null,null,"pendenza","angolo","angolo","moltiplicatore"]
[null,"CONT","%","°","rad","-",null,null,null,null,null,"CONT","TIPO G1"]
[null,1,0,{"$f":"DEGREES(ATAN(C86/100))","v":0},{"$f":"RADIANS(D86)","v":0},{"$f":"(1^2+(C86/100)^2)^0.5","v":1},null,null,null,null,null,1,"AUTOMATICO"]
[null,{"$f":"B86+1","v":2},{"$f":"B86","v":1},0.57293869768348593,{"$f":"RADIANS(D87)","v":9.9996666866652376E-3},1.0000499987500624,null,null,null,null,null,2,"VALORE UTENTE"]
[null,{"$f":"B87+1","v":3},2,1.1457628381751035,1.9997333973150535E-2,1.0001999800039989,null,null,null,null,null,1]
[null,4,3,1.7183580016554572,2.99910048568779E-2,1.0004498987955368]
[null,5,4,2.2906100426385296,3.9978687123290044E-2,1.0007996802557444]
[null,6,5,2.8624052261117479,4.9958395721942765E-2,1.0012492197250393]
[null,7,6,3.433630362450522,5.9928155121207881E-2,1.0017983829094554]
[null,8,7,4.0041729407093882,6.9886001634642508E-2,1.0024470060806208]
[null,9,8,4.5739212599008612,7.9829985712237317E-2,1.0031948963187562]
[null,10,9,5.1427645578842416,8.9758174189950524E-2,1.004041831797859]
[null,11,10,5.710593137499643,9.9668652491162038E-2,1.004987562112089]
[null,12,11,6.2772984895975545,0.10955952677394434,1.0060318086422517]
[null,13,12,6.8427734126309403,0.11942892601833845,1.0071742649611337]
[null,14,13,7.4069121284952297,0.12927500404814307,1.0084145972763385]
[null,15,14,7.9696103943213599,0.13909594148207133,1.0097524449091471]
[null,16,15,8.5307656099481335,0.14888994760949725,1.0111874208078342]
[null,17,16,9.0902769208223226,0.15865526218640141,1.0127191120937731]
[null,18,17,9.6480453160981572,0.16839015714752992,1.014347080638575]
[null,19,18,10.203973721731684,0.17809293823119754,1.016070863670443]
[null,20,19,10.757967088390005,0.18776194651359343,1.0178899744078433]
[null,21,20,11.309932474020215,0.19739555984988078,1.019803902718557]
[null,22,21,11.859779120947978,0.20699219421982101,1.0218121158021176]
[null,23,22,12.407418527400745,0.21655030497608929,1.0239140588936164]
[null,24,23,12.95276451337552,0.22606838799388393,1.0261091559868276]
[null,25,24,13.495733280795811,0.23554498072086333,1.0283968105745953]
[null,26,25,14.036243467926479,0.24497866312686414,1.0307764064044151]
[null,27,26,14.574216198038739,0.25436805855326594,1.0332473082471592]
[null,28,27,15.109575122340466,0.26371183446226615,1.0358088626768938]
[null,29,28,15.642246457208728,0.2730087030867106,1.0384603988597736]
[null,30,29,16.172159015782551,0.28225742198149112,1.0412012293500235]
[null,31,30,{"$f":"DEGREES(ATAN(C116/100))","v":16.699244233993621},0.2914567944778671,1.0440306508910551]
[null,32,31,{"$f":"DEGREES(ATAN(C117/100))","v":17.223436191131462},0.30060567004239541,1.0469479452198185]
[null,33,32,17.744671625056935,0.30970294454245623,{"$f":"(1^2+(C118/100)^2)^0.5","v":1.049952379872535}]
[null,34,{"$f":"B118","v":33},18.262889942194128,0.31874756042064445,1.0530432089900206]
[null,35,34,18.778033222445544,0.32773850678055549,1.0562196741208714]
[null,36,35,19.290046219188735,0.33667481938672722,1.0594810050208545]
[null,37,36,19.798876354524932,0.34555558058171215,1.0628264204469138]
[null,38,37,20.304473709960437,0.3543799191234378,1.0662551289442879]
[null,39,38,20.80679101271123,0.36314700994617627,1.0697663296253066]
[null,40,39,21.305783617828769,0.37185607384858127,1.0733592129385203]
[null,41,40,21.801409486351812,0.3805063771123649,1.077032961426901]
[null,42,41,22.293629159694078,0.38909723105527838,1.0807867504739312]
[null,43,42,22.782405730481688,0.3976279915221293,1.0846197490364999]
[null,44,43,23.267704810056951,0.40609805831761564,1.0885311203635843]
[null,45,44,23.749494492866763,0.41450687458478597,1.0925200226998131]
[null,46,45,24.22774531795417,0.42285392613294071,1.0965856099730655]
[null,47,46,24.702430227771313,0.43113874071878222,1.1007270324653611]
[null,48,47,25.173524524530166,0.43936088728459144,1.1049434374663709]
[null,49,48,25.641005824305282,0.44751997515716985,1.1092339699089637]
[null,50,49,26.104854009099295,0.45561565321122449,1.1135977729862789]
[null,51,50,26.56505117707799,0.46364760900080609,1.1180339887498949]
[null,52,51,27.021581591177039,0.47161556786232767,1.1225417586887358]
[null,53,52,27.474431626277134,0.47951929199259624,1.1271202242884297]
[null,54,53,27.923589715138384,0.48735857950519029,1.1317685275708986]
[null,55,54,28.369046293278583,0.49513326346840414,1.1364858116140297]
[null,56,55,28.810793742973065,0.50284321092786088,1.1412712210513327]
[null,57,56,29.24882633654698,0.51048832191677584,1.1461239025515524]
[null,58,57,29.683140179123296,0.51806852845672091,1.1510430052782563]
[null,59,58,30.113733150982437,0.52558379355161022,1.1560276813294741]
[null,60,59,30.5406048496815,0.53303411017749003,1.1610770861575042]
[null,61,60,30.963756532073521,0.54041950027058416,1.16619037896906]
[null,62,61,31.383191056359031,0.54774001371590242,1.1713667231059623]
[null,63,62,31.798912824294419,0.55499572733858671,1.1766052864066183]
[null,64,63,32.210927723673755,0.56218674390002932,1.1819052415485769]
[null,65,64,32.619243071192827,0.56931319110066192,{"$f":"(1^2+(C150/100)^2)^0.5","v":1.1872657663724664}]
[null,66,{"$f":"B150","v":65},33.023867555796649,{"$f":"RADIANS(D151)","v":0.57637522059118373},1.1926860441876563]
[null,{"$f":"B151+1","v":67},66,33.424811182603804,0.58337300699385597,1.1981652640600127]
[null,68,67,33.822085217493957,0.590306746935372,1.2037026210821342]
[null,69,68,34.215702132437407,0.59717665809267761,1.209297316626478]
[null,70,69,34.605675551638562,0.60398297825299785,1.2149485585818027]
[null,71,70,34.992020198558663,0.61072596438920868,1.2206555615733703]
[null,72,71,35.374751843876084,0.61740589175157279,1.2264175471673584]
[null,73,72,35.753887254436748,0.62402305297675686,1.2322337440599491]
[null,74,73,36.12944414324086,0.63057775721493481,1.2381033882515629]
[null,75,74,36.501441120506314,0.63707032927568352,1.2440257232067189]
[null,76,75,36.86989764584402,0.64350110879328437,1.25]
[null,77,76,37.234833981574667,0.6498704494119476,1.2560254774486066]
[null,78,77,37.596271147211986,0.65617871799139493,1.2621014222319853]
[null,79,78,37.954230875132517,0.66242629383315121,1.2682271089990151]
[null,80,79,38.308735567447719,0.66861356792782101,1.2744018204632321]
[null,81,80,38.659808254090095,0.67474094222355274,1.2806248474865698]
[null,82,81,39.007472552121044,0.68080882891582761,1.2868954891520912]
[null,83,82,39.351752626264734,0.68681764975864523,1.2932130528261767]
[null,84,83,39.692673150668817,0.69276783539712217,1.299576854210631]
[null,85,84,40.030259271889697,0.69865982472146315,1.3059862173851606]
[null,86,85,40.364536573097361,0.70449406424221772,1.3124404748406686]
[null,87,86,40.695531039492018,0.71027100748668626,1.3189389675038037]
[null,88,87,41.023269024922435,0.71599111441630026,1.3254810447531868]
[null,89,88,41.347777219693668,0.72165485086476133,1.3320660644277369]
[null,90,89,41.669082619549954,0.72726268799669036,1.3386933928274989]
[null,91,90,41.987212495816657,0.73281510178650655,1.3453624047073711]
[null,92,91,42.3021943666837,0.73831257251722804,1.3520724832641184]
[null,93,92,42.614055969611186,0.74375558429885991,1.3588230201170424]
[null,94,93,42.922825234837191,0.74914462460601727,1.3656134152826707]
[null,95,94,43.228530259965922,0.75448018383440563,1.372443077143821]
[null,96,95,{"$f":"DEGREES(ATAN(C181/100))","v":43.531199285614179},0.75976275487577083,1.379311422413372]
[null,97,96,43.830860672092584,0.76499283271091023,1.3862178760930766]
[null,98,97,44.127542877097966,0.770170914020331,1.3931618714277247]
[null,99,98,44.421274434392238,0.77529749681212634,1.4001428498549711]
[null,100,99,44.712083933442905,0.78037308006663586,1.4071602609511114]
[null,101,100,45,0.78539816339744828,1.4142135623730951]
[null,1]

{"sheet":"Foglio1","index":7,"n_rows":58,"n_cols":10,"rows_kept":58,"cut":false,"hidden":true,"merged":[[17,1,17,2],[25,1,25,2],[33,1,33,2],[5,5,5,6],[3,1,3,6],[4,3,4,6],[4,1,4,2],[5,1,5,2],[11,1,11,2]]}
[]
[]
[]
[null,"Graficazione elementi",null,null,null,null,null,"n con pmin",{"$f":"Analisi!Q85","v":9},"-"]
[null,"Elementi solaio",null,"Pos connettori",null,null,null,"n con pmax",{"$f":"Analisi!Q84","v":8},"-"]
[null,"Trave",null,"Progressivo","Pos [mm]","Pos adim",null,"nsp pmin"]
[null,0,0,1,{"$f":"Analisi!E85","v":116.25},{"$f":"E7/Analisi!$E$17","v":2.3809523809523808E-2},0.4,"nsp pmax"]
[null,1,0,{"$f":"IF(D7>=(Analisi!$E$83/Analisi!$E$46),\"\",D7+1)","v":2},{"$f":"IF(D8=\"\",\"\",IF(D8<=$I$4,E7+$I$9,IF(D8=$I$4+1,E7+$I$12,IF(AND(D8>($I$4+1),D8<=($I$4+$I$5)),E7+$I$8,IF(D8=($I$4+$I$5+1),E7+$I$12,E7+$I$9)))))","v":246.25},{"$f":"E8/Analisi!$E$17","v":5.0435227854582695E-2},{"$f":"IF(D8=\"\",\"\",$G$7)","v":0.4},"pmax",{"$f":"Analisi!E48","v":330},"mm"]
[null,1,0.4,{"$f":"IF(D8>=(Analisi!$E$83/Analisi!$E$46),\"\",D8+1)","v":3},376.25,{"$f":"E9/Analisi!$E$17","v":7.7060931899641583E-2},{"$f":"IF(D9=\"\",\"\",$G$7)","v":0.4},"pmin",{"$f":"Analisi!E47","v":130},"mm"]
[null,0,0.4,{"$f":"IF(D9>=(Analisi!$E$83/Analisi!$E$46),\"\",D9+1)","v":4},506.25,{"$f":"E10/Analisi!$E$17","v":0.10368663594470046},0.4,"a3",{"$f":"Analisi!E85","v":116.25},"mm"]
[null,0,0,{"$f":"IF(D10>=(Analisi!$E$83/Analisi!$E$46),\"\",D10+1)","v":5},636.25,{"$f":"E11/Analisi!$E$17","v":0.13031233998975936},0.4,"Ltotale",{"$f":"Analisi!E17","v":4882.5},"mm"]
[null,"Soletta",null,{"$f":"IF(D11>=(Analisi!$E$83/Analisi!$E$46),\"\",D11+1)","v":6},766.25,{"$f":"E12/Analisi!$E$17","v":0.15693804403481823},0.4,"scarto",{"$f":"I11/2-I10-(I4-1)*I9-(I5-1)*I8/2","v":130},"mm"]
[null,0,0.4,{"$f":"IF(D12>=(Analisi!$E$83/Analisi!$E$46),\"\",D12+1)","v":7},896.25,{"$f":"E13/Analisi!$E$17","v":0.1835637480798771},0.4]
[null,1,0.4,{"$f":"IF(D13>=(Analisi!$E$83/Analisi!$E$46),\"\",D13+1)","v":8},1026.25,{"$f":"E14/Analisi!$E$17","v":0.210189452124936},0.4]
[null,1,0.6,{"$f":"IF(D14>=(Analisi!$E$83/Analisi!$E$46),\"\",D14+1)","v":9},1156.25,{"$f":"E15/Analisi!$E$17","v":0.23681515616999488},0.4]
[null,0,0.6,{"$f":"IF(D15>=(Analisi!$E$83/Analisi!$E$46),\"\",D15+1)","v":10},1286.25,{"$f":"E16/Analisi!$E$17","v":0.26344086021505375},0.4]
[null,0,0.41,{"$f":"IF(D16>=(Analisi!$E$83/Analisi!$E$46),\"\",D16+1)","v":11},1616.25,{"$f":"E17/Analisi!$E$17","v":0.33102918586789554},0.4]
[null,"Appoggio sx",null,{"$f":"IF(D17>=(Analisi!$E$83/Analisi!$E$46),\"\",D17+1)","v":12},1946.25,{"$f":"E18/Analisi!$E$17","v":0.39861751152073732},0.4]
[null,0,-0.01,{"$f":"IF(D18>=(Analisi!$E$83/Analisi!$E$46),\"\",D18+1)","v":13},2276.25,{"$f":"E19/Analisi!$E$17","v":0.46620583717357911},0.4]
[null,{"$f":"Analisi!E14/Analisi!E17","v":{"$error":"#VALUE!"}},-0.01,{"$f":"IF(D19>=(Analisi!$E$83/Analisi!$E$46),\"\",D19+1)","v":14},2606.25,{"$f":"E20/Analisi!$E$17","v":0.53379416282642089},0.4]
[null,{"$f":"B20","v":{"$error":"#VALUE!"}},-0.15,{"$f":"IF(D20>=(Analisi!$E$83/Analisi!$E$46),\"\",D20+1)","v":15},2936.25,{"$f":"E21/Analisi!$E$17","v":0.60138248847926268},0.4]
[null,{"$f":"B21-0.005","v":{"$error":"#VALUE!"}},-0.15,{"$f":"IF(D21>=(Analisi!$E$83/Analisi!$E$46),\"\",D21+1)","v":16},3266.25,{"$f":"E22/Analisi!$E$17","v":0.66897081413210446},0.4]
[null,{"$f":"B22","v":{"$error":"#VALUE!"}},-0.03,{"$f":"IF(D22>=(Analisi!$E$83/Analisi!$E$46),\"\",D22+1)","v":17},3596.25,{"$f":"E23/Analisi!$E$17","v":0.73655913978494625},0.4]
[null,0,-0.03,{"$f":"IF(D23>=(Analisi!$E$83/Analisi!$E$46),\"\",D23+1)","v":18},3726.25,{"$f":"E24/Analisi!$E$17","v":0.76318484383000507},0.4]
[null,0,-0.01,{"$f":"IF(D24>=(Analisi!$E$83/Analisi!$E$46),\"\",D24+1)","v":19},3856.25,{"$f":"E25/Analisi!$E$17","v":0.789810547875064},0.4]
[null,"Appoggio dx",null,{"$f":"IF(D25>=(Analisi!$E$83/Analisi!$E$46),\"\",D25+1)","v":20},3986.25,{"$f":"E26/Analisi!$E$17","v":0.81643625192012292},0.4]
[null,{"$f":"1+ABS(B19)","v":1},-0.01,{"$f":"IF(D26>=(Analisi!$E$83/Analisi!$E$46),\"\",D26+1)","v":21},{"$f":"IF(D27=\"\",\"\",IF(D27<=$I$4,E26+$I$9,IF(D27=$I$4+1,E26+$I$12,IF(AND(D27>($I$4+1),D27<=($I$4+$I$5)),E26+$I$8,IF(D27=($I$4+$I$5+1),E26+$I$12,E26+$I$9)))))","v":4116.25},{"$f":"E27/Analisi!$E$17","v":0.84306195596518174},0.4]
[null,{"$f":"1-B20","v":{"$error":"#VALUE!"}},-0.01,{"$f":"IF(D27>=(Analisi!$E$83/Analisi!$E$46),\"\",D27+1)","v":22},4246.25,{"$f":"E28/Analisi!$E$17","v":0.86968766001024067},0.4]
[null,{"$f":"B28","v":{"$error":"#VALUE!"}},-0.15,{"$f":"IF(D28>=(Analisi!$E$83/Analisi!$E$46),\"\",D28+1)","v":23},4376.25,{"$f":"E29/Analisi!$E$17","v":0.89631336405529949},0.4]
[null,{"$f":"1-B22","v":{"$error":"#VALUE!"}},-0.15,{"$f":"IF(D29>=(Analisi!$E$83/Analisi!$E$46),\"\",D29+1)","v":24},4506.25,{"$f":"E30/Analisi!$E$17","v":0.92293906810035842},0.4]
[null,{"$f":"B30","v":{"$error":"#VALUE!"}},-0.03,{"$f":"IF(D30>=(Analisi!$E$83/Analisi!$E$46),\"\",D30+1)","v":25},4636.25,{"$f":"E31/Analisi!$E$17","v":0.94956477214541735},0.4]
[null,{"$f":"B27","v":1},-0.03,{"$f":"IF(D31>=(Analisi!$E$83/Analisi!$E$46),\"\",D31+1)","v":26},4766.25,{"$f":"E32/Analisi!$E$17","v":0.97619047619047616},0.4]
[null,{"$f":"B32","v":1},-0.01,{"$f":"IF(D32>=(Analisi!$E$83/Analisi!$E$46),\"\",D32+1)","v":""},"",{"$f":"E33/Analisi!$E$17","v":{"$error":"#VALUE!"}},""]
[null,"quarti trave",null,{"$f":"IF(D33>=(Analisi!$E$83/Analisi!$E$46),\"\",D33+1)","v":""},"",{"$f":"E34/Analisi!$E$17","v":{"$error":"#VALUE!"}},""]
[null,{"$f":"B20","v":{"$error":"#VALUE!"}},0,{"$f":"IF(D34>=(Analisi!$E$83/Analisi!$E$46),\"\",D34+1)","v":""},"",{"$f":"E35/Analisi!$E$17","v":{"$error":"#VALUE!"}},""]
[null,{"$f":"B20","v":{"$error":"#VALUE!"}},{"$f":"C15","v":0.6},{"$f":"IF(D35>=(Analisi!$E$83/Analisi!$E$46),\"\",D35+1)","v":""},"",{"$f":"E36/Analisi!$E$17","v":{"$error":"#VALUE!"}},""]
[null,0.25,0,{"$f":"IF(D36>=(Analisi!$E$83/Analisi!$E$46),\"\",D36+1)","v":""},"",{"$f":"E37/Analisi!$E$17","v":{"$error":"#VALUE!"}},""]
[null,0.25,{"$f":"C36","v":0.6},{"$f":"IF(D37>=(Analisi!$E$83/Analisi!$E$46),\"\",D37+1)","v":""},"",{"$f":"E38/Analisi!$E$17","v":{"$error":"#VALUE!"}},""]
[null,0.5,0,{"$f":"IF(D38>=(Analisi!$E$83/Analisi!$E$46),\"\",D38+1)","v":""},"",{"$f":"E39/Analisi!$E$17","v":{"$error":"#VALUE!"}},""]
[null,0.5,{"$f":"C36","v":0.6},{"$f":"IF(D39>=(Analisi!$E$83/Analisi!$E$46),\"\",D39+1)","v":""},"",{"$f":"E40/Analisi!$E$17","v":{"$error":"#VALUE!"}},""]
[null,0.75,0,{"$f":"IF(D40>=(Analisi!$E$83/Analisi!$E$46),\"\",D40+1)","v":""},"",{"$f":"E41/Analisi!$E$17","v":{"$error":"#VALUE!"}},""]
[null,0.75,{"$f":"C36","v":0.6},{"$f":"IF(D41>=(Analisi!$E$83/Analisi!$E$46),\"\",D41+1)","v":""},"",{"$f":"E42/Analisi!$E$17","v":{"$error":"#VALUE!"}},""]
[null,{"$f":"1-B35","v":{"$error":"#VALUE!"}},0,{"$f":"IF(D42>=(Analisi!$E$83/Analisi!$E$46),\"\",D42+1)","v":""},"",{"$f":"E43/Analisi!$E$17","v":{"$error":"#VALUE!"}},""]
[null,{"$f":"B43","v":{"$error":"#VALUE!"}},{"$f":"C42","v":0.6},{"$f":"IF(D43>=(Analisi!$E$83/Analisi!$E$46),\"\",D43+1)","v":""},"",{"$f":"E44/Analisi!$E$17","v":{"$error":"#VALUE!"}},""]
[null,null,null,{"$f":"IF(D44>=(Analisi!$E$83/Analisi!$E$46),\"\",D44+1)","v":""},{"$f":"IF(D45=\"\",\"\",IF(D45<=$I$4,E44+$I$9,IF(D45=$I$4+1,E44+$I$12,IF(AND(D45>($I$4+1),D45<=($I$4+$I$5)),E44+$I$8,IF(D45=($I$4+$I$5+1),E44+$I$12,E44+$I$9)))))","v":""},{"$f":"E45/Analisi!$E$17","v":{"$error":"#VALUE!"}},{"$f":"IF(D45=\"\",\"\",$G$7)","v":""}]
[null,null,null,{"$f":"IF(D45>=(Analisi!$E$83/Analisi!$E$46),\"\",D45+1)","v":""},"",{"$f":"E46/Analisi!$E$17","v":{"$error":"#VALUE!"}},""]
[null,null,null,{"$f":"IF(D46>=(Analisi!$E$83/Analisi!$E$46),\"\",D46+1)","v":""},"",{"$f":"E47/Analisi!$E$17","v":{"$error":"#VALUE!"}},""]
[null,null,null,{"$f":"IF(D47>=(Analisi!$E$83/Analisi!$E$46),\"\",D47+1)","v":""},"",{"$f":"E48/Analisi!$E$17","v":{"$error":"#VALUE!"}},""]
[null,null,null,{"$f":"IF(D48>=(Analisi!$E$83/Analisi!$E$46),\"\",D48+1)","v":""},"",{"$f":"E49/Analisi!$E$17","v":{"$error":"#VALUE!"}},""]
[null,null,null,{"$f":"IF(D49>=(Analisi!$E$83/Analisi!$E$46),\"\",D49+1)","v":""},"",{"$f":"E50/Analisi!$E$17","v":{"$error":"#VALUE!"}},""]
[null,null,null,{"$f":"IF(D50>=(Analisi!$E$83/Analisi!$E$46),\"\",D50+1)","v":""},"",{"$f":"E51/Analisi!$E$17","v":{"$error":"#VALUE!"}},""]
[null,null,null,{"$f":"IF(D51>=(Analisi!$E$83/Analisi!$E$46),\"\",D51+1)","v":""},"",{"$f":"E52/Analisi!$E$17","v":{"$error":"#VALUE!"}},""]
[null,null,null,{"$f":"IF(D52>=(Analisi!$E$83/Analisi!$E$46),\"\",D52+1)","v":""},"",{"$f":"E53/Analisi!$E$17","v":{"$error":"#VALUE!"}},""]
[null,null,null,{"$f":"IF(D53>=(Analisi!$E$83/Analisi!$E$46),\"\",D53+1)","v":""},"",{"$f":"E54/Analisi!$E$17","v":{"$error":"#VALUE!"}},""]
[null,null,null,{"$f":"IF(D54>=(Analisi!$E$83/Analisi!$E$46),\"\",D54+1)","v":""},"",{"$f":"E55/Analisi!$E$17","v":{"$error":"#VALUE!"}},""]
[null,null,null,{"$f":"IF(D55>=(Analisi!$E$83/Analisi!$E$46),\"\",D55+1)","v":""},"",{"$f":"E56/Analisi!$E$17","v":{"$error":"#VALUE!"}},""]
[null,null,null,{"$f":"IF(D56>=(Analisi!$E$83/Analisi!$E$46),\"\",D56+1)","v":""},"",{"$f":"E57/Analisi!$E$17","v":{"$error":"#VALUE!"}},""]
[null,null,null,{"$f":"IF(D57>=(Analisi!$E$83/Analisi!$E$46),\"\",D57+1)","v":""},"",{"$f":"E58/Analisi!$E$17","v":{"$error":"#VALUE!"}},""]