{"text_format":"1","workbook":"xlsx","n_sheets":8,"sheets":["SOFTWARE T-CON","Analisi","Relazione","Verifica Armatura","Note","Caratteristiche Materiali","Prescrizioni","Foglio1"],"not_rendered":{"charts":3,"images":6,"macros":1,"external_links":0,"defined_names":3,"comments":3,"pivot_tables":0},"unopened":[],"bounds":{"document_bytes":16777216,"sheet_cells":100000,"rows_first":2000,"rows_last":500,"rows_between":2000,"halvings":0,"cell_chars":16384,"cell_head_chars":4096},"cells_cut":0,"cells_raw":0,"read":"whole","date_system":"1900"}

{"sheet":"SOFTWARE T-CON","index":0,"n_rows":37,"n_cols":30,"rows_kept":37,"cut":false,"hidden":false,"merged":[[23,0,23,5],[11,0,11,2],[10,0,10,1],[9,0,9,1],[8,0,8,1],[8,2,8,5],[18,7,18,9],[9,2,9,5],[10,2,10,5],[6,0,6,5],[13,0,13,5]]}
[]
[]
[]
[]
[]
[]
["1) Dati Generali:",null,null,null,null,null,null,"4) Carichi agenti sulla struttura:",null,null,null,null,null,null,null,null,null,null,null,null,null,null,null,null,null,null,null,null,"versione","2.8.2"]
[]
["Cliente/Cantiere:",null,null,null,null,null,null,"Peso permanente strutturale:",null,null,"G1,k ="]
["Identificativo solaio:",null,"C1",null,null,null,null,null,null,null,"=",2.2999999999999998,"kN/m2"]
["Tecnico:",null,"Ufficio Tecnico",null,null,null,null,"Peso permanente non strutturale:",null,null,"G2,k =",2.5,"kN/m2"]
["Normativa di riferimento:",null,null,null,null,null,null,"Carico concentrato (se presente):",null,null,"Pk =",0,"kN"]
[null,null,null,null,null,null,null,"Posizione rispetto appoggio sinistro:",null,null,"a =",3650,"mm"]
["2) Dimensioni del sistema:",null,null,null,null,null,null,"Tipologia di carico variabile:"]
[]
["Luce netta:",null,null,"Lnetta =",4650,"mm",null,"Carico variabile (vedere \"NOTE\"):",null,null,"Qk =",2,"kN/m2"]
["Larghezza appoggi:",null,null,"Lappoggi =","-","mm",null,"Classe di durata del carico:",null,null,null,"            (per info vedere foglio \"NOTE\")",null,null,null,null,null,null,null,null,null,null,null,null,"  "]
["Larghezza vano:",null,null,"Lvano =","-","mm"]
["Interassi travi in legno:",null,null,"i =",650,"mm",null,"5) Inclinazione della struttura:",null,null,"pendenza =",null,"%"]
["Limite freccia istantanea:",null,null,"L/uiniziale =",400,"-"]
{"$rows_left_out":18}
{"sheet":"Analisi","index":1,"n_rows":285,"n_cols":34,"rows_kept":285,"cut":false,"hidden":false,"merged":[[255,0,255,12],[94,0,94,12],[85,0,85,12],[117,10,117,12],[107,0,107,12],[127,3,127,5],[127,10,127,12],[120,0,120,6],[120,7,120,12],[135,0,135,12],[91,0,91,12],[197,0,197,12],[99,9,99,12],[112,9,112,12],[129,4,129,7],[129,11,129,12],[219,0,219,12],[80,0,80,12],[110,10,110,12],[111,10,111,12],[115,10,115,12],[93,10,93,12],[97,10,97,12],[98,10,98,12],[102,10,102,12],[104,10,104,12],[115,0,115,3],[102,0,102,3],[129,0,129,2],[128,0,128,12],[109,0,109,2],[195,0,195,2],[66,11,66,12],[65,0,65,12],[6,0,7,12],[48,10,48,12],[10,0,10,12],[18,0,18,6],[26,0,26,6],[33,7,33,12],[33,0,33,6],[39,3,39,5],[21,3,21,5],[42,3,42,5],[41,0,41,12],[8,9,8,12],[21,0,22,0],[164,13,193,13],[96,8,96,9],[109,8,109,9],[144,10,144,12],[145,0,145,12],[110,0,110,2],[114,0,114,2],[113,0,113,2],[96,0,96,2],[97,0,97,2],[100,0,100,2],[101,0,101,2],[149,0,149,12],[155,10,155,12],[195,4,195,7],[195,11,195,12],[156,0,156,12],[159,10,159,12],[194,0,194,12],[160,0,160,12],[80,14,127,14],[15,14,64,14],[15,13,64,13],[80,13,127,13],[148,10,148,12],[130,14,159,14],[72,0,72,12],[73,7,73,12],[73,0,73,6],[39,0,39,2],[50,3,50,5],[56,3,56,5],[62,3,62,5],[49,0,49,12],[66,0,66,2],[66,4,66,7]]}
[]
[]
[]
[]
[]
[]
["CALCOLO E VERIFICA DI SOLAI MISTI LEGNO-CLS CON CONNETTORI T-CON"]
[]
["Cantiere:",{"$f":"'SOFTWARE T-CON'!C9","v":0},null,null,null,null,null,"Posizione solaio:",null,{"$f":"'SOFTWARE T-CON'!C10","v":"C1"}]
["Data:",{"$f":"TODAY()","v":"2018-12-21"},null,null,null,null,null,"Normativa di riferimento:",null,null,{"$f":"VLOOKUP(Prescrizioni!B7,Prescrizioni!B3:F6,2)","v":"D.M. 17.01.2018 - Colonna \"A\""}]
["GEOMETRIA DEL SOLAIO"]
["Dati sulla lunghezza delle travi del solaio",null,null,null,null,null,null,"Altri dati geometrici e sulla deformabilità:"]
["Luce netta tra gli appoggi:",null,null,"Lnet",{"$f":"'SOFTWARE T-CON'!E16","v":4650},"mm",null,"Interasse travi:",null,null,"i",{"$f":"'SOFTWARE T-CON'!E19","v":650},"mm"]
["Lunghezza appoggio sx:",null,null,"Lapp,sx",{"$f":"'SOFTWARE T-CON'!E17","v":"-"},"mm",null,"Limite freccia istantanea:",null,null,"L/u0",{"$f":"'SOFTWARE T-CON'!E20","v":400},"-"]
["Lunghezza appoggio dx:",null,null,"Lapp,dx",{"$f":"E14","v":"-"},"mm",null,"Limite freccia finale:",null,null,"L/u¥",{"$f":"'SOFTWARE T-CON'!E21","v":300},"-"]
["Lungh. totale della trave:",null,null,"Ltot",{"$f":"IF(AND(E14=\"-\",E15=\"-\"),\"-\",SUM(E13:E15))","v":"-"},"mm",null,null,null,null,null,null,null,"Il presente foglio non può essere modificato e/o distributo in alcun modo senza il consenso scritto di RoofRox Srl."]
["Luce di calcolo:",null,null,"Lcalcolo",{"$f":"IF(AND(E14=\"-\",E15=\"-\"),1.05*E13,IF(Prescrizioni!B187>1,ROUNDUP(VLOOKUP(Prescrizioni!B187,Prescrizioni!B86:F186,5)*Analisi!E13,0),(E14/2+E13+E15/2)))","v":4882.5},"mm",null,"Dimensione trasversale solaio:",null,null,"Lvano",{"$f":"'SOFTWARE T-CON'!E18","v":"-"},"mm"]
[{"$f":"'SOFTWARE T-CON'!H13","v":"Posizione rispetto appoggio sinistro:"},null,null,"a",{"$f":"'SOFTWARE T-CON'!L13","v":3650},"mm"]
["CARATTERISTICHE GEOMETRICHE DELLA SEZIONE DELLE TRAVI"]
["Soletta","- base:",null,"b1",{"$f":"L13","v":650},"mm"]
{"$rows_left_out":266}
{"sheet":"Relazione","index":2,"n_rows":225,"n_cols":14,"rows_kept":225,"cut":false,"hidden":false,"merged":[[224,0,224,2],[224,6,224,8],[224,13,224,14],[71,0,71,2],[71,13,71,14],[150,0,150,2],[150,13,150,14],[138,11,138,13],[170,4,170,6],[146,9,146,10],[219,1,220,13],[172,4,172,5],[173,4,173,5],[174,4,174,5],[171,4,171,6],[172,8,172,10],[173,8,173,10],[174,8,174,10],[140,9,140,10],[204,1,205,13],[141,3,141,4],[147,3,147,4],[150,6,150,8],[12,4,12,8],[12,9,12,10],[6,0,7,14],[22,4,22,8],[22,9,22,10],[9,3,9,7],[9,13,9,14],[29,4,29,6],[111,6,111,7],[104,10,104,12],[121,10,121,12],[128,6,128,7],[91,11,91,13],[65,4,65,6],[57,4,57,6],[57,11,57,13],[82,6,82,9],[71,6,71,8],[69,8,69,10],[69,11,69,13]]}
[]
[]
[]
[]
[]
[]
["RELAZIONE DI CALCOLO : VERIFICA DI SOLAI MISTI LEGNO-CLS CON CONNETTORI \"T-CON\""]
[]
["Cantiere:",null,null,{"$f":"Analisi!B9","v":0},null,null,null,null,null,null,null,null,"Data:",{"$f":"TODAY()","v":"2018-12-21"}]
["Posizione solaio:",null,null,{"$f":"Analisi!J9","v":"C1"},null,null,null,null,null,null,null,null,"ID interno:"]
[]
[]
[null,null,null,null,"Caratteristiche della connessione: Connettore",null,null,null,null,{"$f":"VLOOKUP('Caratteristiche Materiali'!B60,'Caratteristiche Materiali'!B58:C59,2)","v":"T-CON 8.0x205"}]
[null,null,null,null,"Resistenza caratt. allo snervamento:",null,null,null,"fy,k =",900,"N/mm2"]
[null,null,null,null,"Momento caratt. di snervamento:",null,null,null,"My,k =",{"$f":"Analisi!L263","v":22600},"Nmm"]
[null,null,null,null,"Lunghezza totale del connettore:",null,null,null,"Ltot =",{"$f":"VLOOKUP('Caratteristiche Materiali'!B60,'Caratteristiche Materiali'!B58:E59,4)","v":208.85},"mm"]
[null,null,null,null,"Diametro del connettore:",null,null,null,"d =",{"$f":"VLOOKUP('Caratteristiche Materiali'!B60,'Caratteristiche Materiali'!B58:E59,3)","v":8},"mm"]
[null,null,null,null,"Lunghezza parte filettata nel legno:",null,null,null,"Lwood =",{"$f":"Analisi!L47","v":115.7157287525381},"mm"]
[null,null,null,null,"Lunghezza efficace della vite:",null,null,null,"Lef = ",{"$f":"Analisi!L259","v":100},"mm"]
[null,null,null,null,"Lunghezza del tratto nel calstruzzo:",null,null,null,"Lcls =",{"$f":"Analisi!L46","v":64.849999999999994},"mm"]
{"$rows_left_out":206}
{"sheet":"Verifica Armatura","index":3,"n_rows":217,"n_cols":13,"rows_kept":217,"cut":false,"hidden":false,"merged":[[142,0,142,2],[142,6,142,7],[142,12,142,13],[216,0,216,2],[216,6,216,7],[216,12,216,13],[77,10,77,12],[6,0,7,13],[9,3,9,6],[9,12,9,13],[92,10,92,12],[69,0,69,2],[69,6,69,7],[69,12,69,13],[36,10,36,12],[43,10,43,12],[64,10,64,12],[57,10,57,12],[65,0,68,13]]}
[]
[]
[]
[]
[]
[]
["RELAZIONE DI CALCOLO : VERIFICA ARMATURE DI RIPARTIZIONE NELLA SOLETTA IN CLS E ARMATURA DEL CORDOLO                 SOLAI MISTI LEGNO-CLS CON CONNETTORI \"T-CON\""]
[]
["Cantiere:",null,null,{"$f":"Analisi!B9","v":0},null,null,null,null,null,null,null,"Data:",{"$f":"TODAY()","v":"2018-12-21"}]
["Posizione solaio:",null,null,{"$f":"Analisi!J9","v":"C1"},null,null,null,null,null,null,null,"ID interno:"]
[]
["1 Riepilogo valori impiegati:"]
[]
["Spessore della soletta:",null,null,null,null,null,null,null,null,null,"h1 =",{"$f":"Analisi!E21","v":60},"mm"]
["Interassi travi in legno:",null,null,null,null,null,null,null,null,null,"i = b1 =",{"$f":"Analisi!L13","v":650},"mm"]
["Interasse collaborante:",null,null,null,null,null,null,null,null,null,"ic =",{"$f":"'SOFTWARE T-CON'!E25","v":650},"mm"]
["Coefficiente di resistenza differita del legno:",null,null,null,null,null,null,null,null,null,"kmod =",{"$f":"Analisi!$L$40","v":0.8},"-"]
["Resistenza caratteristica acciaio B450C:",null,null,null,null,null,null,null,null,null,"fy,k",450,"N/mm2"]
["Resistenza caratteristica a compressione cilindrica cls:",null,null,null,null,null,null,null,null,null,"fc,k =",{"$f":"Analisi!E58","v":25},"N/mm2"]
["Resistenza caratteristica a trazione cls:",null,null,null,null,null,null,null,null,null,"ft,k =",{"$f":"Analisi!E59","v":1.7954747440105308},"N/mm2"]
{"$rows_left_out":198}
{"sheet":"Note","index":4,"n_rows":50,"n_cols":9,"rows_kept":50,"cut":false,"hidden":false,"merged":[]}
[]
[]
[null,"DATI RIPORTATI NEL TESTO: \"Strutture in Legno\" - Materiale, calcolo e preogetto secondo le nuove normative europee - "]
[null,"Maurizio Piazza; Roberto Tomasi; Roberto Modena - Editore: HOEPLI"]
[]
[]
[null,"CARICHI DI DURATA PERMANENTE",null,null,null,"pesi propri e carichi non rimovibili (durante la vita della struttura)"]
[]
[null,"CARICHI DI LUNGA DURATA",null,null,null,"carichi permanenti suscettibili di cambiamenti (durante il normale esercizio della struttura)"]
[null,null,null,null,null,"sovraccarichi variabili relativi a magazzini e depositi."]
[]
[null,"CARICHI DI MEDIA DURATA",null,null,null,"i sovraccarichi variabili (esercizio sui solai e neve sulle coperture)"]
[]
[null,"CARICHI DI DURATA ISTANTANEA",null,null,null,"azioni del vento e le azioni eccezionali"]
[]
[]
[]
[null,"Classi di durata del carico",null,null,null,"Durata del carico caratteristico"]
[]
[null,"Permanente",null,null,null,"più di 10 anni"]
{"$rows_left_out":31}
{"sheet":"Caratteristiche Materiali","index":5,"n_rows":81,"n_cols":24,"rows_kept":81,"cut":false,"hidden":true,"merged":[]}
[]
[null,null,"Resistenze legno lamellare di conifera omogeneo e combinato (EN 1194: 1999)",null,null,null,null,null,null,null,null,null,null,null,null,null,null,null,null,null,null,null,"Barre d'armatura"]
[null,null,null,"[N/mmq]","[N/mmq]","[N/mmq]","[N/mmq]","[N/mmq]","[N/mmq]","[N/mmq]","[N/mmq]","[N/mmq]","[N/mmq]","[kg/mc]","[kg/mc]"]
[null,"CONT",null,"fm,g,k","ft,0,g,k","ft,90,g,k","fc,0,g,k","fc,90,g,k","fv,g,k","E0,g,mean","E0,g,05","E90,g,mean","Gg,mean","rg,k","rm",null,null,null,null,null,null,"CONT","fi","A"]
[null,1,"GL20h",20,16,0.5,20,2.5,3.5,8400,7000,300,650,340,370,null,null,null,null,null,null,1,10,{"$f":"PI()*W5^2/4","v":78.539816339744831}]
[null,{"$f":"B5+1","v":2},"GL20c",20,15,0.5,18.5,2.5,3.5,10400,8600,300,250,355,390,null,null,null,null,null,null,2,12,{"$f":"PI()*W6^2/4","v":113.09733552923255}]
[null,{"$f":"B6+1","v":3},"GL22h",22,17.600000000000001,0.5,22,2.5,3.5,10500,8800,300,650,370,410,"uni en 14080:2013",null,null,null,null,null,3,14,{"$f":"PI()*W7^2/4","v":153.93804002589985}]
[null,4,"GL22c",22,16,0.5,20,2.5,3.5,10400,8600,300,650,355,390,"uni en 14080:2013",null,null,null,null,null,4,16,{"$f":"PI()*W8^2/4","v":201.06192982974676}]
[null,5,"GL24h",24,19.2,0.5,24,2.5,3.5,11500,9600,300,650,385,420,"uni en 14080:2013",null,null,null,null,null,2]
[null,6,"GL24c",24,17,0.5,21.5,2.5,3.5,11000,9100,300,650,365,400,"uni en 14080:2013"]
[null,7,"GL26h",26,20.8,0.5,26,2.5,3.5,12100,10100,300,650,405,445,"uni en 14080:2013",null,null,null,null,null,"CONT","numeri"]
[null,8,"GL26c",26,19,0.5,23.5,2.5,3.5,12000,10000,300,650,385,420,"uni en 14080:2013",null,null,null,null,null,1,0]
[null,9,"GL28h",28,22.3,0.5,28,2.5,3.5,{"$f":"12.6*1000","v":12600},10500,300,650,425,460,"uni en 14080:2013",null,null,null,null,null,2,1]
[null,10,"GL28c",28,19.5,0.5,24,2.5,3.5,12500,10400,300,650,390,420,"uni en 14080:2013",null,null,null,null,null,3,2]
[null,11,"GL30h",30,24,0.5,30,2.5,3.5,13600,11300,300,650,430,480,"uni en 14080:2013",null,null,null,null,null,1]
[null,12,"GL30c",30,19.5,0.5,24.5,2.5,3.5,13000,10800,300,650,390,430,"uni en 14080:2013"]
[null,13,"GL32h",32,25.6,0.5,32,2.5,3.5,14200,11800,300,650,440,490,"uni en 14080:2013"]
[null,14,"GL32c",32,19.5,0.5,24.5,2.5,3.5,13700,11200,300,650,400,440,"uni en 14080:2013"]
[null,15,"C14",14,8,0.4,16,2,1.7,{"$f":"7*1000","v":7000},{"$f":"4.7*1000","v":4700},{"$f":"0.23*1000","v":230},{"$f":"0.44*1000","v":440},290,350,"prEN 338: 2002"]
[null,16,"C16",16,10,0.5,17,2.2000000000000002,1.8,{"$f":"8*1000","v":8000},{"$f":"5.4*1000","v":5400},{"$f":"0.27*1000","v":270},{"$f":"0.5*1000","v":500},310,370,"prEN 338: 2002"]
{"$rows_left_out":62}
{"sheet":"Prescrizioni","index":6,"n_rows":187,"n_cols":14,"rows_kept":187,"cut":false,"hidden":true,"merged":[]}
[null,"Normative di riferimento"]
[null,"CONT",null,"Lamellare","Massiccio","Unioni"]
[null,1,"D.M. 17.01.2018 - Colonna \"A\"",1.45,1.5,1.5]
[null,2,"D.M. 17.01.2018 - Colonna \"B\"",1.35,1.45,1.4]
[null,3,"D.M. 14.01.2008",1.45,1.5,1.5]
[null,4,"UNI EN 1995-1-1:2014",1.25,1.3,1.3]
[null,1]
[]
[]
[null,"LIMITI PER SOLAI DI COPERTURA",null,null,null,null,"(riferiti per luce L in pianta)"]
[null,"limite freccia istantanea sui (soli) carichi variabili",null,null,null,null,"qk:","u2,ist < L / ",300]
[null,"limite freccia finale sui (soli) carichi variabili",null,null,null,null,"qk:","u2,fin < L / ",200]
[null,"limite freccia netta (finale) su tutti i carichi:",null,null,null,null,"gk e qk:","unet,fin < L / ",200]
[]
[]
[null,"LIMITI PER SOLAI di interpiano (consigliati)",null,null,null,null,"(riferiti per luce L in pianta)"]
[null,"limite freccia istantanea sui (soli) carichi variabili",null,null,null,null,"qk:","u2,ist < L /",400]
[null,"limite freccia finale sui (soli) carichi variabili",null,null,null,null,"qk:","u2,fin < L /",500]
[null,"limite freccia netta (finale) su tutti i carichi:",null,null,null,null,"gk e qk:","unet,fin < L /",500]
[]
{"$rows_left_out":168}
{"sheet":"Foglio1","index":7,"n_rows":58,"n_cols":10,"rows_kept":58,"cut":false,"hidden":true,"merged":[[17,1,17,2],[25,1,25,2],[33,1,33,2],[5,5,5,6],[3,1,3,6],[4,3,4,6],[4,1,4,2],[5,1,5,2],[11,1,11,2]]}
[]
[]
[]
[null,"Graficazione elementi",null,null,null,null,null,"n con pmin",{"$f":"Analisi!Q85","v":9},"-"]
[null,"Elementi solaio",null,"Pos connettori",null,null,null,"n con pmax",{"$f":"Analisi!Q84","v":8},"-"]
[null,"Trave",null,"Progressivo","Pos [mm]","Pos adim",null,"nsp pmin"]
[null,0,0,1,{"$f":"Analisi!E85","v":116.25},{"$f":"E7/Analisi!$E$17","v":2.3809523809523808E-2},0.4,"nsp pmax"]
[null,1,0,{"$f":"IF(D7>=(Analisi!$E$83/Analisi!$E$46),\"\",D7+1)","v":2},{"$f":"IF(D8=\"\",\"\",IF(D8<=$I$4,E7+$I$9,IF(D8=$I$4+1,E7+$I$12,IF(AND(D8>($I$4+1),D8<=($I$4+$I$5)),E7+$I$8,IF(D8=($I$4+$I$5+1),E7+$I$12,E7+$I$9)))))","v":246.25},{"$f":"E8/Analisi!$E$17","v":5.0435227854582695E-2},{"$f":"IF(D8=\"\",\"\",$G$7)","v":0.4},"pmax",{"$f":"Analisi!E48","v":330},"mm"]
[null,1,0.4,{"$f":"IF(D8>=(Analisi!$E$83/Analisi!$E$46),\"\",D8+1)","v":3},376.25,{"$f":"E9/Analisi!$E$17","v":7.7060931899641583E-2},{"$f":"IF(D9=\"\",\"\",$G$7)","v":0.4},"pmin",{"$f":"Analisi!E47","v":130},"mm"]
[null,0,0.4,{"$f":"IF(D9>=(Analisi!$E$83/Analisi!$E$46),\"\",D9+1)","v":4},506.25,{"$f":"E10/Analisi!$E$17","v":0.10368663594470046},0.4,"a3",{"$f":"Analisi!E85","v":116.25},"mm"]
[null,0,0,{"$f":"IF(D10>=(Analisi!$E$83/Analisi!$E$46),\"\",D10+1)","v":5},636.25,{"$f":"E11/Analisi!$E$17","v":0.13031233998975936},0.4,"Ltotale",{"$f":"Analisi!E17","v":4882.5},"mm"]
[null,"Soletta",null,{"$f":"IF(D11>=(Analisi!$E$83/Analisi!$E$46),\"\",D11+1)","v":6},766.25,{"$f":"E12/Analisi!$E$17","v":0.15693804403481823},0.4,"scarto",{"$f":"I11/2-I10-(I4-1)*I9-(I5-1)*I8/2","v":130},"mm"]
[null,0,0.4,{"$f":"IF(D12>=(Analisi!$E$83/Analisi!$E$46),\"\",D12+1)","v":7},896.25,{"$f":"E13/Analisi!$E$17","v":0.1835637480798771},0.4]
[null,1,0.4,{"$f":"IF(D13>=(Analisi!$E$83/Analisi!$E$46),\"\",D13+1)","v":8},1026.25,{"$f":"E14/Analisi!$E$17","v":0.210189452124936},0.4]
[null,1,0.6,{"$f":"IF(D14>=(Analisi!$E$83/Analisi!$E$46),\"\",D14+1)","v":9},1156.25,{"$f":"E15/Analisi!$E$17","v":0.23681515616999488},0.4]
[null,0,0.6,{"$f":"IF(D15>=(Analisi!$E$83/Analisi!$E$46),\"\",D15+1)","v":10},1286.25,{"$f":"E16/Analisi!$E$17","v":0.26344086021505375},0.4]
[null,0,0.41,{"$f":"IF(D16>=(Analisi!$E$83/Analisi!$E$46),\"\",D16+1)","v":11},1616.25,{"$f":"E17/Analisi!$E$17","v":0.33102918586789554},0.4]
[null,"Appoggio sx",null,{"$f":"IF(D17>=(Analisi!$E$83/Analisi!$E$46),\"\",D17+1)","v":12},1946.25,{"$f":"E18/Analisi!$E$17","v":0.39861751152073732},0.4]
[null,0,-0.01,{"$f":"IF(D18>=(Analisi!$E$83/Analisi!$E$46),\"\",D18+1)","v":13},2276.25,{"$f":"E19/Analisi!$E$17","v":0.46620583717357911},0.4]
[null,{"$f":"Analisi!E14/Analisi!E17","v":{"$error":"#VALUE!"}},-0.01,{"$f":"IF(D19>=(Analisi!$E$83/Analisi!$E$46),\"\",D19+1)","v":14},2606.25,{"$f":"E20/Analisi!$E$17","v":0.53379416282642089},0.4]
{"$rows_left_out":38}